{"text_format":"1","workbook":"xlsx","n_sheets":4,"sheets":["Sheet1","Sheet2","Sheet3","Sheet5"],"not_rendered":{"charts":0,"images":0,"macros":0,"external_links":2,"defined_names":17,"comments":0,"pivot_tables":0},"unopened":[],"bounds":{"document_bytes":16777216,"sheet_cells":100000,"rows_first":2000,"rows_last":500,"rows_between":2000,"halvings":0,"cell_chars":16384,"cell_head_chars":4096},"cells_cut":0,"cells_raw":0,"read":"whole","date_system":"1900"}

{"sheet":"Sheet1","index":0,"n_rows":731,"n_cols":10,"rows_kept":731,"cut":false,"hidden":false,"merged":[]}
["Employee Name","Working Type","Department","First Contact","Years","Number of Contacts","2010 Sales","2011 Sales"]
["Jacobs, Florianne","Full time","ADC","2001-03-02",{"$f":"DATEDIF(D2,TODAY(),\"Y\")","v":15},73,239900,190000,null,{"$f":"E2*F2","v":1095}]
["Nixon, Randy","Half Time","ADC","1993-07-09",23,28,290200,202400,null,{"$f":"G3+H3+Sheet2!G2","v":4720228.8500000006}]
["Reese, Marc","Intern","ADC","1997-12-08",18,25,202200,150700]
["Estes, Mary","Half Time","ADC","2008-10-23",7,69,342600,175900,null,{"$f":"G5*Sheet2!E5+Sheet5!B13","v":25100589464}]
["Crawford, Ronald","Contract","ADC","1999-03-19",17,18,129800,228500]
["Perez, Kim","Half Time","Admin Training","2007-12-07",8,69,209700,250700,null,{"$f":"G10+[2]حقوق!$G$5","v":288949.8}]
["Rush, Lateef",null,"Admin Training","2007-08-02",9,29,329300,311000]
["Strickland, Rajean",null,"Admin Training","1988-07-04",28,69,147400,223600,null,{"$f":"G10+Sheet2!G3+[2]حقوق!$F$6","v":1004646.6}]
["Fisher, Maria",null,"Admin Training","2002-08-23",14,64,255900,213500]
["Robles, Charles",null,"Admin Training","1993-10-12",22,48,170200,305700]
["Hart, Richard",null,"Admin Training","1994-04-01",22,78,135800,339000]
["Humphrey, Andrew",null,"Admin Training","2001-01-09",15,51,244400,293500]
["Chavez, Thomas",null,"Admin Training","1993-10-14",22,43,167000,327200]
["Morton, Brian",null,"Admin Training","1989-08-25",27,36,238300,300200]
["Horn, George",null,"Admin Training","1994-12-16",21,51,214700,272100]
["Carroll, Lesa",null,"Admin Training","1996-10-24",19,70,278900,220100]
["Hoover, Evangeline",null,"Admin Training","2008-12-08",7,54,266200,127000]
["Gentry, John",null,"Admin Training","1994-03-31",22,76,271400,132300]
["Hawkins, Douglas",null,"Admin Training","1994-09-05",22,61,285100,182000]
["Wilkins, Jesse",null,"Admin Training","1994-05-27",22,57,246700,216000]
["Gomez, Ed",null,"Admin Training","2006-04-20",10,43,149000,176300]
["Miles, Kenneth",null,"Admin Training","1988-07-06",28,17,166700,312600]
["Baker, Barney",null,"Audit Services","1995-02-09",21,32,164100,150000]
["Carrillo, Robert",null,"Audit Services","1991-12-02",24,44,228500,199500]
["Salazar, Ruben",null,"Audit Services","1997-09-16",19,22,281600,154200]
["Harrington, Aron",null,"Audit Services","1990-06-27",26,68,287900,172200]
["Walker, Mike",null,"Audit Services","2001-08-03",15,75,319500,136500]
["Franklin, Alicia",null,"Audit Services","2000-02-21",16,72,199100,319100]
["Ross, Janice",null,"Audit Services","1996-11-18",19,39,167100,142100]
["Abbott, James",null,"Audit Services","1997-03-13",19,69,325000,184900]
["Boone, Eric",null,"Audit Services","1996-07-08",20,44,156200,221900]
["Sparks, Terri",null,"Audit Services","1993-06-21",23,21,125300,302500]
["Morrison, Julie",null,"Compliance","2007-11-20",8,76,194500,178800]
["Phillips, Liesl",null,"Compliance","1995-11-09",20,78,325100,228900]
["Gordon, Diane",null,"Compliance","2005-12-13",10,68,144100,259000]
["Montgomery, Christopher",null,"Compliance","1991-03-24",25,23,307500,216500]
["Trevino, Gary",null,"Engineering/Maintenance","1990-04-30",26,66,296500,261800]
["Merritt, Kevin",null,"Engineering/Maintenance","1997-03-31",19,16,326500,264600]
["Greene, Alexander",null,"Engineering/Maintenance","2000-10-05",16,10,186100,335800]
["Ayers, Douglas",null,"Engineering/Maintenance","1995-06-23",21,59,224100,182900]
["Stevenson, Michael",null,"Engineering/Maintenance","1989-05-02",27,65,289400,273300]
["Perry, Christopher",null,"Engineering/Maintenance","1994-08-03",22,55,242200,262900]
["Henry, Craig",null,"Engineering/Maintenance","2004-04-09",12,65,323000,297500]
["Cameron, John",null,"Engineering/Maintenance","2003-03-17",13,52,249000,189500]
["Flowers, Kathleen",null,"Engineering/Maintenance","2001-03-23",15,13,265000,218600]
["West, Jeffrey",null,"Engineering/Maintenance","1994-11-19",21,22,230400,230100]
["King, Taslim",null,"Engineering/Maintenance","1991-03-22",25,88,137800,142500]
["Atkinson, Danielle",null,"Engineering/Maintenance","1996-09-05",20,16,261200,143900]
["Bond, John",null,"Engineering/Maintenance","1993-12-23",22,54,139300,258700]
["Lewis, Frederick",null,"Engineering/Maintenance","1997-01-09",19,50,192200,125500]
["Mills, Melissa",null,"Engineering/Maintenance","2008-10-27",7,81,306600,208900]
["Conway, Brett",null,"Engineering/Maintenance","1993-10-22",22,25,249200,262800]
["Lopez, Stephen",null,"Engineering/Maintenance","1997-01-13",19,52,259600,347600]
["Floyd, Eric",null,"Engineering/Maintenance","2000-04-24",16,10,308600,161200]
["Goodwin, April",null,"Engineering/Maintenance","1989-05-16",27,85,270400,237400]
["Payne, Vicky",null,"Engineering/Maintenance","2007-01-11",9,25,325200,212800]
["Randall, Yvonne",null,"Engineering/Maintenance","1999-01-28",17,44,315500,179300]
["Schroeder, Bennet",null,"Engineering/Maintenance","1988-07-29",28,65,263100,133800]
["Hobbs, Scott",null,"Engineering/Maintenance","1991-04-08",25,81,240100,162700]
["Walter, Michael",null,"Engineering/Maintenance","1994-07-15",22,49,320400,242100]
["Hall, Jenny",null,"Engineering/Maintenance","1997-02-27",19,72,207400,164800]
["Blankenship, Roger",null,"Engineering/Maintenance","1990-07-11",26,17,191500,273900]
["Juarez, Neill",null,"Engineering/Maintenance","1995-09-29",21,58,290000,263200]
["Harris, Brian",null,"Engineering/Maintenance","1998-03-14",18,33,169700,164500]
["Snyder, Duane",null,"Engineering/Maintenance","1996-03-05",{"$f":"DATEDIF(D66,TODAY(),\"Y\")","v":20},32,221400,333800]
["Barton, Barry",null,"Engineering/Maintenance","1991-01-18",25,51,262900,226500]
["Wallace, Timothy",null,"Engineering/Maintenance","1989-06-24",27,64,146100,178100]
["Bates, Verna",null,"Engineering/Maintenance","1997-04-10",19,55,235600,189300]
["Matthews, Diane",null,"Engineering/Maintenance","2003-02-14",13,20,194200,199100]
["Newton, Leigh",null,"Engineering/Maintenance","1997-08-31",19,70,217800,236700]
["Barber, Robbie",null,"Engineering/Maintenance","1993-02-02",23,34,221000,137500]
["Booker, Judith",null,"Engineering/Maintenance","1989-01-11",27,25,139700,179000]
["Montoya, Lisa",null,"Engineering/Maintenance","2007-12-17",8,50,338400,233700]
["Vargas, Bryant",null,"Engineering/Maintenance","1990-10-18",25,80,347800,216800]
["Gray, Mark",null,"Engineering/Maintenance","1990-03-24",26,79,215100,243200]
["Price, Diana",null,"Engineering/Maintenance","1988-05-19",28,29,336200,286200]
["Noble, Michael",null,"Engineering/Maintenance","1992-07-02",24,42,188800,187600]
["Lawrence, Ronald",null,"Engineering/Maintenance","1998-12-18",17,10,290800,205700]
["Cochran, Andrea",null,"Engineering/Maintenance","1995-05-25",21,35,291600,213500]
["Stephens, Bonnie",null,"Engineering/Maintenance","2005-12-29",10,42,179300,311700]
["Garrison, Christopher",null,"Engineering/Maintenance","1994-12-30",21,88,193500,175000]
["Short, Timothy",null,"Engineering/Maintenance","1995-10-27",20,22,338900,333000]
["McCoy, Preston",null,"Engineering/Maintenance","2008-02-05",8,57,178100,320000]
["Wolfe, Keith",null,"Engineering/Maintenance","1988-11-03",27,12,185000,275100]
["French, Robert",null,"Engineering/Maintenance","1993-03-17",23,54,304000,312900]
["Monroe, Justin",null,"Engineering/Maintenance","1989-12-06",26,30,340900,281300]
["Doyle, Leslie",null,"Engineering/Maintenance","1996-03-18",20,77,181800,143800]
["Dalton, Carol",null,"Engineering/Maintenance","2000-02-18",16,82,172400,231600]
["Ryan, Ryan",null,"Engineering/Maintenance","1993-04-12",23,81,143200,306200]
["Johnston, Daniel",null,"Engineering/Maintenance","2007-08-28",9,67,294500,331100]
["Skinner, Jason",null,"Engineering/Operations","1995-06-13",21,65,24340,25243]
["Charles, Jeffrey",null,"Engineering/Operations","1994-11-23",21,14,249055,183283]
["Wolf, Debbie",null,"Environmental Health/Safety","2000-03-16",16,78,260551,55486]
["Bauer, Chris",null,"Environmental Health/Safety","2006-10-30",9,55,207140,139352]
["McClain, Steven",null,"Environmental Health/Safety","2002-08-11",14,79,79512,188617]
["Austin, William",null,"Environmental Health/Safety","2006-07-10",10,65,244131,141915]
["Farmer, Suzanne",null,"Environmental Health/Safety","2002-02-17",14,44,283843,146336]
["Stafford, Rhonda",null,"Environmental Health/Safety","1995-04-03",21,40,263507,121642]
["Glenn, Christopher",null,"Environmental Health/Safety","2005-04-18",11,37,281769,222451]
["Farrell, Laura",null,"Environmental Health/Safety","2004-01-30",12,17,177124,172563]
["Sexton, John",null,"Environmental Health/Safety","2002-12-23",13,85,191508,284676]
["Vazquez, Kenneth",null,"Executive Education","2008-11-04",7,39,170244,114793]
["Duran, Brian",null,"Executive Education","2002-10-10",13,13,192799,215254]
["Buckel, Patricia",null,"Executive Education","2000-12-14",15,64,139005,59650]
["Atkins, Kevin",null,"Executive Education","2005-11-09",10,64,69320,164505]
["Wiggins, Frank",null,"Executive Education","1996-01-17",20,43,171326,199773]
["Bradford, Raymond",null,"Executive Education","2007-09-04",9,42,96508,135979]
["Briggs, Bryan",null,"Executive Education","2009-02-28",7,10,180738,71560]
["Boyd, Debra",null,"Executive Education","1999-04-06",17,80,220448,105888]
["Barnes, Grant",null,"Executive Education","2008-05-12",8,79,157905,195263]
["Tanner, Timothy",null,"Executive Education","2003-04-04",13,29,234758,164263]
["Castro, Christopher",null,"Executive Education","2001-11-21",14,65,130549,246076]
["Lloyd, John",null,"Executive Education","1998-09-18",18,57,214419,268881]
["Ellis, Brenda",null,"Executive Education","2008-07-16",8,46,58963,211522]
["Alexander, Charles",null,"Executive Education","1995-12-03",20,84,295200,105648]
["Fox, Ellen",null,"Executive Education","2003-11-19",12,29,35519,51684]
["Clayton, Gregory",null,"Executive Education","1993-05-31",23,63,57386,37933]
["Morgan, Patricia",null,"Executive Education","1993-12-31",22,57,274869,116688]
["Jackson, Eric",null,"Executive Education","1995-12-07",20,76,57041,246119]
["Scott, Todd",null,"Executive Education","1998-05-01",18,49,55897,135491]
["Landry, Linda",null,"International Clinical Safety","2007-04-16",9,88,119124,258711]
["Bailey, Victor",null,"International Clinical Safety","1993-05-11",23,82,70600,117528]
["Potter, Dawn",null,"International Clinical Safety","2003-10-11",12,46,275957,251554]
["Becker, Gretchen",null,"International Clinical Safety","1997-12-26",18,28,142579,98093]
["Orr, Jennifer",null,"International Clinical Safety","1998-08-06",18,29,283321,248331]
["Park, Timothy",null,"Logistics","1994-05-15",22,57,168800,226695]
["Vincent, Guy",null,"Logistics","1993-08-25",23,24,202447,196843]
["Anthony, Robert",null,"Logistics","2000-07-07",16,10,78551,210662]
["Molina, Michael",null,"Logistics","2006-09-18",{"$f":"DATEDIF(D130,TODAY(),\"Y\")","v":10},55,85945,136069]
["Fuller, Brenda",null,"Logistics","2006-04-12",10,83,176724,287418]
["Lee, Charles",null,"Logistics","1996-04-23",20,48,151798,78194]
["Chandler, Diane",null,"Logistics","1997-04-10",19,52,179870,221081]
["Norris, Tamara",null,"Logistics","1993-08-14",23,69,275646,192277]
["Elliott, Anthony",null,"Logistics","2008-05-20",8,23,161591,63841]
["Glover, Eugene",null,"Logistics","2007-01-31",9,85,265376,164476]
["Snow, Desiree",null,"Logistics","2005-05-01",11,50,132241,72461]
["Olsen, Ewan",null,"Logistics","2006-08-18",10,33,286661,165792]
["Chang, Gabriel",null,"Logistics","2006-10-31",9,36,293664,215723]
["Russell, Mark",null,"Logistics","2006-12-14",9,16,160107,254295]
["Nichols, Nathaniel",null,"Logistics","2001-05-17",15,44,271539,151628]
["Lyons, Brian",null,"Logistics","2009-05-05",7,34,40680,201606]
["Taylor, Hector",null,"Logistics","2008-07-30",8,51,217718,219423]
["Maynard, Susan",null,"Logistics","2006-10-17",9,86,245919,95626]
["Fletcher, Brian",null,"Logistics","1999-09-07",17,87,282587,158845]
["Ortiz, Cynthia",null,"Logistics","1999-02-11",17,58,117645,234736]
["Bradley, David",null,"Logistics","2000-04-11",16,34,234452,170263]
["Hull, Jeanne",null,"Logistics","2000-01-29",16,58,291705,141237]
["McCarthy, Ryan",null,"Logistics","1996-06-28",20,72,222537,286196]
["Mueller, Philip",null,"Logistics","2005-11-26",10,67,166998,183780]
["Garner, Terry",null,"Logistics","2004-03-24",12,80,221600,74054]
["Gallegos, Rick",null,"Logistics","2001-03-01",15,48,151283,116907]
["Townsend, Jerry",null,"Logistics","1995-12-26",20,85,293611,32009]
["William, William",null,"Logistics","2001-10-28",14,46,294923,88223]
["Collins, Michael",null,"Logistics","2000-09-28",16,44,203918,195860]
["Whitaker, Jessica",null,"Logistics","1996-03-03",20,14,270326,201289]
["Gibson, Janet",null,"Logistics","2001-02-17",15,81,229869,267159]
["Carlson, Jeremy",null,"Logistics","1995-06-28",21,72,158924,151796]
["Gutierrez, Regina",null,"Logistics","1993-08-20",23,16,142878,95545]
["Henson, Debra",null,"Logistics","2007-07-17",9,69,60618,239929]
["Roy, Margarita",null,"Logistics","2004-02-10",12,12,174685,101487]
["Young, Benjamin",null,"Logistics","1994-11-27",21,80,161644,298619]
["Howard, Lisa",null,"Logistics","2008-07-08",8,41,175923,255208]
["Powers, Tia",null,"Logistics","2008-11-21",7,10,197939,57617]
["Koch, Danielle",null,"Major Mfg Projects","2007-12-20",8,20,38597,61461]
["Mack, Barry",null,"Major Mfg Projects","2005-03-15",11,48,196984,132599]
["Wood, Larry",null,"Major Mfg Projects","2009-01-10",7,45,31502,284021]
["Dudley, James",null,"Major Mfg Projects","2007-11-01",8,72,229306,264036]
["Williams, Scott",null,"Major Mfg Projects","2001-12-25",14,17,266494,292488]
["Norman, Rita",null,"Major Mfg Projects","1997-11-14",18,70,256429,188098]
["Vega, Alexandra",null,"Major Mfg Projects","2005-12-29",10,42,223530,32456]
["Wilkinson, Gregory",null,"Major Mfg Projects","2001-05-17",15,48,178297,239778]
["George, Jessica",null,"Manufacturing","2006-07-25",10,58,31754,183318]
["Riley, David",null,"Manufacturing","2001-06-12",15,53,54198,123533]
["Hunt, Norman",null,"Manufacturing","2002-05-03",14,10,48934,162947]
["Ware, David",null,"Manufacturing","2000-05-11",16,31,268590,172327]
["Foster, Blane",null,"Manufacturing","2006-04-01",10,84,273839,82686]
["Bishop, Juan",null,"Manufacturing","2006-04-17",10,44,106230,288692]
["Contreras, Dean",null,"Manufacturing","2003-08-03",13,49,281687,267541]
["Hogan, Daniel",null,"Manufacturing","2006-12-18",9,15,90041,126742]
["Foley, Peter",null,"Manufacturing","2003-11-02",12,71,103205,89366]
["McDaniel, Tamara",null,"Manufacturing","2001-08-10",15,28,136896,143984]
["Munoz, Michael",null,"Manufacturing","1993-05-17",23,35,87906,241318]
["White, Daniel",null,"Manufacturing","2000-09-30",16,54,42105,85775]
["Osborne, Bill",null,"Manufacturing","2006-02-03",10,40,292882,210307]
["Richards, Richard",null,"Manufacturing","1999-07-14",17,37,263964,223788]
["Carr, Susan",null,"Manufacturing","2003-05-11",13,14,170069,96729]
["Harmon, Paul",null,"Manufacturing","1994-04-20",22,18,252941,187359]
["Pierce, Karen",null,"Manufacturing","2000-09-19",16,41,97594,226819]
["Roberson, Eileen",null,"Manufacturing","2007-11-17",8,54,221835,90515]
["McDonald, Debra",null,"Manufacturing","1996-05-20",20,16,41472,42541]
["Kelley, Nancy",null,"Manufacturing","2008-11-12",7,78,244089,94689]
["Avila, Jody",null,"Manufacturing","2005-12-22",10,79,164205,117366]
["Dennis, Paul",null,"Manufacturing","2003-01-30",{"$f":"DATEDIF(D194,TODAY(),\"Y\")","v":13},27,146684,241250]
["Leon, Emily",null,"Manufacturing","2007-12-28",8,59,295159,146947]
["Kemp, Holly",null,"Manufacturing","1999-02-22",17,75,31867,226276]
["Melton, Scott",null,"Manufacturing","2003-03-04",13,83,293109,140915]
["Mendoza, Bobby",null,"Manufacturing","1994-03-28",22,41,41286,246878]
["Solomon, Michael",null,"Manufacturing","2003-08-31",13,52,136683,49203]
["Pittman, Bacardi",null,"Manufacturing","2001-01-08",15,81,114315,28438]
["Owen, Robert",null,"Manufacturing","1999-02-08",17,71,78249,298851]
["Fields, Cathy",null,"Manufacturing","1998-11-14",17,41,68816,30301]
["Jordan, Mark",null,"Manufacturing","2005-11-11",10,84,106308,278923]
["Rice, Diane",null,"Manufacturing","2006-07-05",10,80,28173,56850]
["English, David",null,"Manufacturing","1994-10-27",21,59,146677,25981]
["Edwards, Phillip",null,"Manufacturing","2007-01-12",9,61,207314,248951]
["Weiss, Marisa",null,"Manufacturing","1996-04-22",20,38,152996,77407]
["McLaughlin, Edward",null,"Manufacturing","1996-02-25",20,63,175488,260917]
["Hubbard, Sandra",null,"Manufacturing","2007-01-11",9,70,150549,188876]
["Beard, Sandi",null,"Manufacturing","2005-07-29",11,41,78790,241423]
["Copeland, Roger",null,"Manufacturing","2006-11-04",9,43,219477,46731]
["Hughes, Kevin",null,"Manufacturing","1998-08-27",18,83,146818,211179]
["Casey, Ronald",null,"Manufacturing","2000-10-04",16,21,50639,251491]
["Weber, Larry",null,"Manufacturing","2008-08-11",8,31,181531,263905]
["Holt, Robert",null,"Manufacturing","1999-03-21",17,64,168699,50001]
["Flynn, Melissa",null,"Manufacturing","2001-04-30",15,34,160827,200344]
["Hancock, Allen",null,"Manufacturing","2006-10-19",9,87,215537,126823]
["Baxter, Teresa",null,"Manufacturing","2005-07-15",11,30,84956,176990]
["Bass, Justin",null,"Manufacturing","1998-12-29",17,39,54593,167831]
["Kirk, Chris",null,"Manufacturing","1994-03-17",22,63,227079,277414]
["Alvarado, Sonia",null,"Manufacturing","1998-02-16",18,63,75073,276121]
["Lane, Brandyn",null,"Manufacturing","1996-09-17",20,32,198470,194591]
["Carey, Andrea",null,"Manufacturing","1998-02-04",18,86,193817,196529]
["Green, Kim",null,"Manufacturing","2008-04-02",8,58,275451,67087]
["Richardson, Deborah",null,"Manufacturing","1997-07-28",19,83,274645,180454]
["Sandoval, James",null,"Manufacturing","1995-04-30",21,54,206127,30529]
["Deleon, Jaquelyn",null,"Manufacturing","1999-03-19",17,84,145651,182483]
["Kennedy, Kimberly",null,"Manufacturing","2001-04-02",15,39,152208,259578]
["Spears, Melanie",null,"Manufacturing","1995-09-01",21,67,279599,117686]
["Knight, Denise",null,"Manufacturing","1995-06-28",21,70,207785,28115]
["Wilkerson, Claudia",null,"Manufacturing","2009-03-23",7,77,33756,185622]
["Prince, Robert",null,"Manufacturing","1993-11-03",22,53,94615,130004]
["Tucker, James",null,"Manufacturing","2005-11-12",10,42,183620,27975]
["Thomas, Shannon",null,"Manufacturing","2003-03-05",13,21,292111,95567]
["Butler, Roy",null,"Manufacturing","2009-05-13",7,55,198903,267711]
["Sellers, William",null,"Manufacturing","2003-03-05",13,39,179805,73125]
["Salinas, Jon",null,"Manufacturing","2007-10-25",8,11,291070,209678]
["Barrett, John",null,"Manufacturing","2003-06-07",13,76,207576,50657]
["Kent, Angus",null,"Manufacturing","1994-07-23",22,59,171881,206984]
["Phelps, Gretchen",null,"Manufacturing","1994-12-05",21,67,284256,54782]
["Dyer, Carrie",null,"Manufacturing","2005-11-24",10,73,280413,217155]
["Drake, Kyle",null,"Manufacturing","2001-09-08",15,81,30329,94602]
["Wade, Kevin",null,"Manufacturing","1996-01-15",20,11,120518,195393]
["Vaughn, Harlon",null,"Manufacturing","2007-05-03",9,88,292311,274576]
["Lang, Dana",null,"Manufacturing","2004-02-21",12,40,193677,233827]
["Alvarez, Steven",null,"Manufacturing","2003-02-04",13,13,202776,160491]
["Harding, Erin",null,"Manufacturing","2001-09-28",15,64,244128,204555]
["Mullins, Angela",null,"Manufacturing","1996-04-01",20,52,187470,230579]
["Vance, Cheryl",null,"Manufacturing","2006-06-13",10,42,185416,82186]
["Cole, Elbert",null,"Manufacturing","2009-01-12",7,47,175881,285647]
["Swanson, Vicki",null,"Manufacturing","2000-11-02",15,58,62827,53909]
["Oliver, Francisco",null,"Manufacturing","2002-06-06",14,11,229930,77988]
["Ramsey, Nathaniel",null,"Manufacturing","2003-03-06",13,35,134193,272193]
["Powell, Juli",null,"Manufacturing","1997-08-07",19,22,116951,245407]
["Robbins, Suzanne",null,"Manufacturing","1997-07-02",19,85,28158,164453]
["Gill, Douglas",null,"Manufacturing","2004-06-04",12,36,54166,272285]
["Day, David",null,"Manufacturing","1995-01-03",21,14,246893,281555]
["Burke, Michael",null,"Manufacturing","1999-09-28",{"$f":"DATEDIF(D258,TODAY(),\"Y\")","v":17},75,130250,45057]
["Schmidt, Michael",null,"Manufacturing","1994-02-26",22,61,50849,240081]
["Cline, Rebecca",null,"Manufacturing","2001-05-04",15,60,221416,77197]
["Valdez, Ann",null,"Manufacturing","1995-10-23",20,48,172441,51810]
["Grimes, Jeffrey",null,"Manufacturing","1997-10-04",19,56,194350,283274]
["Saunders, Corey",null,"Manufacturing","2002-03-27",14,46,26456,230970]
["Parker, Carl",null,"Manufacturing","2008-09-17",8,83,243147,132577]
["Miranda, Elena",null,"Manufacturing","1999-08-12",17,86,236538,253817]
["Nguyen, Dennis",null,"Manufacturing","1993-04-23",23,23,213599,198545]
["Byrd, Asa",null,"Manufacturing","2003-04-22",13,57,172573,65991]
["McConnell, Justin",null,"Manufacturing","2008-01-08",8,53,161661,258002]
["Hudson, Lorna",null,"Manufacturing","2002-04-05",14,57,207965,78843]
["Robertson, Nathan",null,"Manufacturing","1994-09-21",22,52,269220,266957]
["Schultz, Norman",null,"Manufacturing","1999-03-16",17,68,213433,181281]
["Brady, Traci",null,"Manufacturing","1999-08-02",17,62,114043,123443]
["Frazier, Chris",null,"Manufacturing","2000-02-14",16,63,92639,294246]
["McKinney, Christofer",null,"Manufacturing","2000-08-24",16,38,283739,139775]
["Adkins, Michael",null,"Manufacturing","1997-08-01",19,25,284816,263780]
["Watkins, Gary",null,"Manufacturing","2006-12-17",9,61,257043,262865]
["Cummings, Jose",null,"Manufacturing","1996-05-05",20,50,62320,247014]
["Morris, Richelle",null,"Manufacturing","2001-12-15",14,36,159531,199301]
["Wiley, Gustavo",null,"Manufacturing","1997-01-09",19,34,126233,270066]
["McDowell, Scott",null,"Manufacturing","2006-03-08",10,15,210531,151288]
["Burns, Fiona",null,"Manufacturing","1994-07-11",22,46,290756,63827]
["Summers, Harold",null,"Manufacturing","2004-03-14",12,71,193647,104098]
["Sawyer, Catherine",null,"Manufacturing","2002-11-20",13,37,43042,81376]
["Rodriguez, Scott",null,"Manufacturing","1996-04-01",20,73,262100,84304]
["Gonzalez, David",null,"Manufacturing","2005-01-07",11,41,140933,257151]
["Spencer, Boyd",null,"Manufacturing","1996-06-28",20,57,183427,46995]
["Wells, Carlos",null,"Manufacturing","2000-12-29",15,52,197457,53154]
["Ballard, Martin",null,"Manufacturing","2000-12-21",15,62,279911,106412]
["Mathis, Shari",null,"Manufacturing","1993-10-12",22,64,66988,130614]
["Gallagher, Johnson",null,"Manufacturing","2006-06-15",10,18,201399,117794]
["Joseph, Christopher",null,"Manufacturing","2007-05-30",9,79,31800,259748]
["Lowe, Michelle",null,"Manufacturing","2002-02-05",14,80,156433,230499]
["Hodge, Craig",null,"Manufacturing","2002-09-21",14,16,160578,45062]
["Kirby, Michael",null,"Manufacturing","2007-10-19",8,47,66494,27224]
["Herring, Joanna",null,"Manufacturing","1993-07-01",23,84,193335,229615]
["Welch, Michael",null,"Manufacturing","1994-01-21",22,32,80165,180638]
["Waters, Alfred",null,"Manufacturing","2002-05-11",14,78,212930,222204]
["Terry, Karin",null,"Manufacturing","2006-06-17",10,51,66597,141230]
["Dickerson, Lincoln",null,"Manufacturing","1999-11-26",16,39,168441,202350]
["Burton, Cam",null,"Manufacturing","2002-03-01",14,47,73060,211656]
["Ball, Kirk",null,"Manufacturing","1999-06-24",17,55,174210,26756]
["Kerr, Mihaela",null,"Manufacturing","2008-04-23",8,55,107794,86074]
["Cohen, Bruce",null,"Manufacturing","2001-10-31",14,22,166498,142649]
["Stokes, Jonathan",null,"Manufacturing","2000-08-04",16,19,84459,130677]
["Jones, John",null,"Manufacturing","2003-12-10",12,75,223870,134978]
["Frost, Adam",null,"Manufacturing","1995-11-30",20,87,29054,225224]
["Chapman, Jessica",null,"Manufacturing","2001-05-09",15,78,98432,244444]
["Ferguson, John",null,"Manufacturing","2001-08-18",15,12,206547,55983]
["Leblanc, Jenny",null,"Manufacturing","2009-01-16",7,82,287857,150397]
["McGee, Carol",null,"Manufacturing","1997-10-02",19,58,146894,241898]
["Patrick, Wendy",null,"Manufacturing","2006-02-05",10,49,63225,296437]
["Long, Gary",null,"Manufacturing","2000-12-05",15,66,94279,210216]
["Fleming, Irv",null,"Manufacturing","1995-10-24",20,55,135254,164421]
["Francis, Todd",null,"Manufacturing","2007-01-27",9,67,248769,158773]
["Moody, Matthew",null,"Manufacturing","1993-10-22",22,85,205530,93598]
["Reyes, Mary",null,"Manufacturing","1998-12-04",17,74,186040,223127]
["Bean, Deborah",null,"Manufacturing","1994-01-09",22,81,134301,271217]
["Schneider, Gay",null,"Manufacturing","1996-10-05",20,78,237509,257436]
["Sloan, Cindy",null,"Manufacturing","2008-08-27",8,59,254354,206817]
["Carson, Anthony",null,"Manufacturing","1997-11-14",18,49,244851,154050]
["Morrow, Richard",null,"Manufacturing","1998-11-19",17,56,39024,284100]
["Cunningham, Denise",null,"Manufacturing","1996-05-01",{"$f":"DATEDIF(D322,TODAY(),\"Y\")","v":20},51,26899,179708]
["Vasquez, Michael",null,"Manufacturing","2008-10-09",7,64,160200,224729]
["Webb, Jim",null,"Manufacturing Admin","1994-08-03",22,82,259957,280036]
["Cooper, Lisa",null,"Manufacturing Admin","2000-11-22",15,36,226560,151757]
["Coleman, Roque",null,"Manufacturing Admin","1996-01-15",20,75,51987,107239]
["Shaw, Pat",null,"Manufacturing Admin","1999-10-07",17,57,285360,194801]
["McBride, Grazyna",null,"Manufacturing Admin","1998-03-20",18,43,135350,245157]
["Lawson, Erin",null,"Manufacturing Admin","2002-11-08",13,76,207545,79571]
["Hamilton, Theo",null,"Manufacturing Admin","2004-08-22",12,57,123240,246123]
["Klein, Robert",null,"Operations","1999-04-24",17,78,165791,99192]
["Cox, Stephanie",null,"Operations","1996-05-21",20,48,46221,209617]
["Holmes, Tito",null,"Operations","1994-03-08",22,17,260438,177085]
["Hurst, Thomas",null,"Operations","2002-03-02",14,67,221339,261466]
["Cortez, Jack",null,"Operations","1998-08-20",18,83,274619,196800]
["Bryan, Thomas",null,"Operations","2006-03-23",10,10,197922,269864]
["Martinez, Kathleen",null,"Operations","1999-01-04",17,78,176691,240696]
["Armstrong, David",null,"Operations","1995-08-06",21,77,155533,139554]
["Soto, Christopher",null,"Operations","2003-02-25",13,12,91541,155273]
["Kim, Deborah",null,"Operations","1998-11-29",17,16,263041,233086]
["Anderson, Teason",null,"Operations","2005-04-17",11,68,31848,59324]
["Nunez, Benning",null,"Operations","1998-05-06",18,78,271301,160060]
["Kramer, Faye",null,"Operations","2005-05-03",11,27,31412,121555]
["Holloway, Christopher",null,"Operations","2004-02-25",12,79,170289,69949]
["House, Paul",null,"Operations","2009-03-07",7,82,164729,77721]
["Gonzales, David",null,"Operations","2007-11-25",8,43,54957,252105]
["Bradshaw, Sheryl",null,"Operations","2002-02-23",14,28,154250,252579]
["Savage, John",null,"Operations","2007-11-06",8,21,83527,50413]
["Curry, Hunyen",null,"Operations","2006-05-19",10,49,86113,266937]
["Ramos, Jan",null,"Operations","1998-11-21",17,44,62988,34676]
["Barker, Heidi",null,"Operations","2001-03-19",15,83,147515,78555]
["Collier, Dean",null,"Operations","1998-06-08",18,50,190842,39225]
["Moses, Mark",null,"Operations","2007-12-06",8,40,100000,143646]
["Ward, Williams",null,"Operations","1994-04-26",22,12,54562,292549]
["Willis, Ralph",null,"Operations","2008-06-29",8,26,214385,131419]
["Richard, Karen",null,"Operations","2000-08-05",16,67,253224,189465]
["Petersen, Timothy",null,"Operations","2003-06-25",13,84,34110,228559]
["Pitts, Dana",null,"Operations","1993-10-12",22,18,121290,57226]
["Cobb, Nicole",null,"Operations","1999-01-13",17,29,252178,222327]
["Goodman, Kuyler",null,"Operations","1996-11-19",19,74,254402,223242]
["Carter, Allan",null,"Operations","2002-02-10",14,36,197783,254998]
["Jefferson, Elaine",null,"Operations","2000-12-25",15,31,234969,245405]
["Nash, Mark",null,"Operations","1995-08-22",21,47,92501,81758]
["Walls, Brian",null,"Operations","1993-11-14",22,73,245864,170248]
["Weaver, Eric",null,"Operations","1998-12-28",17,39,221588,234474]
["Harper, Cynthia",null,"Operations","2007-10-12",8,65,294510,214893]
["Perkins, Donald",null,"Operations","1996-02-03",20,20,27917,253988]
["Davidson, Jaime",null,"Operations","2004-10-17",11,59,96489,135843]
["Rogers, Colleen",null,"Operations","2003-07-28",13,35,267500,63883]
["Figueroa, Leonard",null,"Operations","2008-11-02",7,40,30293,190942]
["Bowen, Kes",null,"Operations","1998-10-02",18,35,273537,100838]
["Reeves, Greg",null,"Operations","1997-04-16",19,46,202782,174545]
["Mann, Lowell",null,"Operations","2007-04-20",9,70,87018,33906]
["Jimenez, Dominic",null,"Operations","1999-06-21",17,11,277672,70955]
["Walsh, Matthew",null,"Operations","1996-03-27",20,15,73350,252566]
["Callahan, Marilyn",null,"Operations","2001-04-08",15,77,113608,266418]
["Larsen, Lara",null,"Operations","2002-11-23",13,29,69122,94725]
["Pacheco, Therese",null,"Operations","1998-01-25",18,73,258647,66249]
["Bridges, Jeff",null,"Operations","2002-10-31",13,24,252674,171302]
["Poole, Tracy",null,"Operations","1995-11-06",20,85,34324,54913]
["Harvey, Michael",null,"Operations","1996-12-14",19,59,152599,242908]
["Johnson, Mary Jo",null,"Peptide Chemistry","2001-11-08",14,62,95036,253225]
["Ray, ReAnnon",null,"Peptide Chemistry","1996-06-14",20,42,223929,114013]
["Stevens, Andrew",null,"Peptide Chemistry","1996-09-18",20,35,65365,209469]
["Parks, Christopher",null,"Peptide Chemistry","1997-12-28",18,25,247739,106923]
["Morse, Michael",null,"Peptide Chemistry","2006-02-19",{"$f":"DATEDIF(D386,TODAY(),\"Y\")","v":10},28,104909,278505]
["Maldonado, Robert",null,"Peptide Chemistry","2004-09-14",12,61,74320,183909]
["Tyler, Javier",null,"Peptide Chemistry","2002-05-02",14,64,174716,220948]
["Wilson, Jessica",null,"Peptide Chemistry","1997-04-27",19,33,124057,75131]
["Wilcox, Robert",null,"Peptide Chemistry","1993-10-01",23,44,26301,214265]
["Dixon, Richard",null,"Peptide Chemistry","2002-12-26",13,47,100816,57509]
["Moss, Chan",null,"Peptide Chemistry","2008-03-20",8,23,87046,233699]
["Allison, Timothy",null,"Peptide Chemistry","2005-11-12",10,18,96811,105954]
["Huffman, Ignacio",null,"Peptide Chemistry","1995-09-10",21,30,43338,298287]
["Singleton, David",null,"Peptide Chemistry","1999-07-01",17,43,287442,43701]
["Velez, Letitia",null,"Peptide Chemistry","2005-11-29",10,23,278501,32190]
["Grant, Leonard",null,"Peptide Chemistry","1999-04-29",17,32,233970,142737]
["Ingram, Matt",null,"Peptide Chemistry","2005-07-24",11,24,73674,129054]
["Hardy, Svetlana",null,"Peptide Chemistry","2005-10-05",11,46,292560,82881]
["Neal, Sally",null,"Peptide Chemistry","2007-03-12",9,69,255504,55330]
["Tate, Zachary",null,"Peptide Chemistry","2001-05-13",15,41,67957,145776]
["Gibbs, Debra",null,"Peptide Chemistry","2002-06-15",14,71,121914,290346]
["Gilbert, Shannon",null,"Pharmacokinetics","2002-04-12",14,31,222059,241776]
["Conner, Mark",null,"Pharmacokinetics","1999-08-21",17,18,196927,86622]
["Sharp, Janine",null,"Pharmacokinetics","1997-07-19",19,56,267501,204837]
["Chase, Troy",null,"Pharmacokinetics","2002-06-13",14,64,163484,51022]
["Logan, Karen",null,"Process Development","1993-12-18",22,73,266772,63526]
["Lambert, Jody",null,"Process Development","1995-06-26",21,78,268218,185833]
["Hansen, Andrew",null,"Process Development","2004-01-11",12,88,142172,149200]
["Decker, Amy",null,"Process Development","1996-09-11",20,60,127789,207217]
["Duncan, George",null,"Process Development","2000-08-10",16,42,265764,177001]
["Lamb, John",null,"Process Development","2002-04-18",14,77,52000,270374]
["Patton, Corey",null,"Process Development","2007-09-21",9,64,43874,47492]
["Jennings, Gary",null,"Process Development","2008-12-06",7,77,145560,182251]
["Wall, John",null,"Process Development","2001-03-10",15,28,192682,154335]
["Hayes, Edward",null,"Process Development","2001-03-11",15,71,208444,282413]
["Bush, Rena",null,"Process Development","1998-06-30",18,23,161731,65159]
["Evans, Rolin",null,"Process Development","1996-05-05",20,69,272008,170102]
["McLean, Richard",null,"Process Development","2006-05-05",10,58,219506,200263]
["Randolph, Kristin",null,"Process Development","1994-01-20",22,38,135035,273882]
["Wright, Brad",null,"Process Development","2000-09-07",16,87,104066,265668]
["Bartlett, Julia",null,"Process Development","2005-10-12",10,47,278647,140306]
["Hill, Robin",null,"Process Development","1997-07-20",19,56,28852,117135]
["Golden, Christine",null,"Process Development","1993-11-18",22,47,167364,289606]
["Calhoun, Dac Vinh",null,"Process Development","1994-04-27",22,77,214203,231648]
["Adams, David",null,"Process Development","1998-08-18",18,45,273920,124924]
["Palmer, Terry",null,"Process Development","2009-05-04",7,21,230429,194285]
["Mason, Suzanne",null,"Process Development","1993-10-07",23,69,186896,59812]
["Ruiz, Randall",null,"Process Development","2006-12-29",9,68,281088,137119]
["Underwood, Todd",null,"Process Development","2009-07-05",7,60,106391,189779]
["Ford, Matt",null,"Process Development","1998-08-09",18,34,179265,147992]
["Tran, Chad",null,"Process Development","2004-12-29",11,31,257901,289220]
["Todd, Steven",null,"Process Development","2005-04-26",11,21,225320,173238]
["Sheppard, Curtis",null,"Process Development","2004-10-10",11,77,156426,192389]
["Browning, Kathleen",null,"Process Development","1995-10-08",21,76,265384,34638]
["Murray, Rebecca",null,"Process Development","2004-01-31",12,34,290675,31515]
["Hodges, Lisa",null,"Process Development","2003-06-13",13,70,203677,269601]
["Dorsey, Matthew",null,"Process Development","2001-03-18",15,71,262024,284402]
["Espinoza, Derrell",null,"Process Development","1997-03-29",19,68,237124,158658]
["Simmons, Robert",null,"Process Development","2001-12-13",14,85,137324,233981]
["Garrett, Christopher",null,"Process Development","2002-07-08",14,33,200453,266200]
["Davis, Tonya",null,"Process Development","2006-10-05",10,80,228361,59641]
["Shaffer, Nobuko",null,"Process Development","2000-03-22",16,71,109072,176842]
["Greer, Brian",null,"Process Development","2008-02-17",8,50,202731,125910]
["Rivers, Douglas",null,"Process Development","1995-04-26",21,61,132147,256073]
["McGuire, Rebecca",null,"Process Development","2004-11-01",11,70,56106,100572]
["James, Lynn",null,"Process Development","2008-03-01",8,41,190917,226524]
["Wheeler, Meegan",null,"Process Development","1993-03-17",23,34,238513,37211]
["Dominguez, Duane",null,"Process Development","1996-09-16",20,41,296422,147053]
["Keller, Jason",null,"Process Development","1996-07-15",{"$f":"DATEDIF(D450,TODAY(),\"Y\")","v":20},30,174540,176998]
["Luna, Rodney",null,"Professional Training Group","1994-07-25",22,40,140436,288579]
["May, Steve",null,"Professional Training Group","2007-09-20",9,56,156826,159147]
["Graves, Michael",null,"Professional Training Group","1996-11-05",19,18,106133,31629]
["Camacho, Stephanie",null,"Professional Training Group","1994-12-22",21,32,55747,186304]
["Gilmore, Terry",null,"Professional Training Group","2006-11-28",9,74,58062,160152]
["Medina, Warren",null,"Professional Training Group","1997-05-19",19,78,247757,44121]
["Blair, Sperry",null,"Professional Training Group","2001-06-09",15,63,144022,128185]
["Gaines, Sheela",null,"Professional Training Group","2005-06-14",11,44,66935,223985]
["Sanders, Troy",null,"Professional Training Group","2007-12-10",8,20,233125,141344]
["Beck, Craig",null,"Professional Training Group","1997-10-13",18,17,91290,135098]
["Barnett, Brenda",null,"Professional Training Group","1996-04-07",20,82,274319,232272]
["Caldwell, Pete",null,"Professional Training Group","2003-07-12",13,75,295007,87188]
["Hernandez, Glenn",null,"Professional Training Group","1999-07-31",17,73,195344,160362]
["Beasley, Timothy",null,"Professional Training Group","1994-02-13",22,34,271306,243757]
["Black, Cliff",null,"Professional Training Group","2001-05-30",15,85,120534,108115]
["Bell, David",null,"Professional Training Group","2005-07-10",11,84,263534,115949]
["Lindsey, Deborah",null,"Project & Contract Services","1997-07-30",19,80,81280,74595]
["Horton, Cleatis",null,"Project & Contract Services","2002-07-16",14,61,213375,137798]
["McCormick, Hsi",null,"Project & Contract Services","2003-02-10",13,43,143236,230499]
["Sims, Don",null,"Project & Contract Services","1994-05-21",22,37,185800,64678]
["Hicks, Monica",null,"Project & Contract Services","2004-08-20",12,69,92235,285658]
["Moore, Robert",null,"Project & Contract Services","2006-02-24",10,32,250886,62996]
["Yates, Doug",null,"Project & Contract Services","1998-10-22",17,72,27839,232681]
["Turner, Ray",null,"Project & Contract Services","2002-05-08",14,65,100529,282689]
["Mathews, Marcia",null,"Project & Contract Services","2003-10-28",12,14,92638,96391]
["Simon, Sheila",null,"Project & Contract Services","2000-12-19",15,77,78513,33605]
["Obrien, Madelyn",null,"Project & Contract Services","2006-03-19",10,41,95049,271039]
["Chambers, Richard",null,"Project & Contract Services","2009-06-01",7,11,223713,132630]
["Colon, Donnie",null,"Project & Contract Services","1996-12-06",19,77,69781,144722]
["Freeman, Dennis",null,"Project & Contract Services","1998-06-30",18,44,55473,83987]
["Burnett, Kevin",null,"Project & Contract Services","1996-12-22",19,59,30815,227026]
["Pena, Erik",null,"Project & Contract Services","2001-10-19",14,12,262825,102578]
["Conley, Mark",null,"Project & Contract Services","2008-03-19",8,67,88542,64555]
["Giles, Kathleen",null,"Project & Contract Services","1996-01-28",20,86,264720,171265]
["Blevins, Carey",null,"Project & Contract Services","1999-01-18",17,70,171305,36626]
["Heath, Deborah",null,"Project & Contract Services","2006-02-03",10,59,244129,48042]
["Thornton, Charles",null,"Project & Contract Services","2009-06-12",7,25,231775,295714]
["Stewart, Elizabeth",null,"Project & Contract Services","1998-12-18",17,55,96725,251645]
["Preston, Chris",null,"Project & Contract Services","1998-06-18",18,68,216432,33774]
["Gardner, Anthony",null,"Project & Contract Services","1998-04-19",18,55,178353,276416]
["Hoffman, Brian D",null,"Project & Contract Services","1994-10-02",22,83,252326,89622]
["Leonard, Paul",null,"Project & Contract Services","1995-10-07",21,77,165228,85810]
["Finley, James",null,"Project & Contract Services","2005-07-06",11,78,88117,187437]
["Pace, Joseph",null,"Project & Contract Services","2003-03-02",13,76,74135,49601]
["Patel, Donald",null,"Project & Contract Services","2004-05-02",12,61,266542,104642]
["Dunn, Matthew",null,"Project & Contract Services","1993-12-14",22,21,296847,43449]
["Dodson, David",null,"Project & Contract Services","2008-04-26",8,65,70090,196590]
["Webster, David",null,"Project & Contract Services","1994-05-01",22,45,272194,227092]
["Nicholson, Lee",null,"Project & Contract Services","1993-10-10",22,34,185677,57455]
["Velasquez, Clint",null,"Project & Contract Services","2001-02-27",15,85,299010,167705]
["Hatfield, Carl",null,"Project & Contract Services","1999-12-09",16,48,100008,122671]
["Walton, Benjamin",null,"Project & Contract Services","1999-01-02",17,76,278633,25034]
["Peters, Robert",null,"Project & Contract Services","1994-03-05",22,46,94186,208769]
["Cross, Marc",null,"Project & Contract Services","1997-10-06",19,26,183462,177756]
["Pearson, Cassy",null,"Project & Contract Services","1997-02-14",19,84,218170,126564]
["Burgess, Cherie",null,"Project & Contract Services","1998-07-06",18,43,31724,183826]
["Villarreal, Stephen",null,"Project & Contract Services","2007-07-28",9,64,192288,88596]
["Hampton, Catherine",null,"Project & Contract Services","2005-11-05",10,57,90468,85135]
["Christian, Melissa",null,"Project & Contract Services","2006-08-07",10,33,89454,77170]
["Meyers, David",null,"Project & Contract Services","2002-08-07",14,34,127347,154684]
["Shannon, Kevin",null,"Project & Contract Services","1999-11-13",16,65,235828,103000]
["Rowe, Ken",null,"Project & Contract Services","2002-01-27",14,33,62537,127847]
["Leach, Jingwen",null,"Project & Contract Services","2005-04-17",11,80,205745,169291]
["Weeks, Troy",null,"Project & Contract Services","1993-12-17",{"$f":"DATEDIF(D514,TODAY(),\"Y\")","v":22},73,137852,131557]
["Pratt, Erik",null,"Project & Contract Services","2007-11-27",8,86,177355,94719]
["Santiago, Michael",null,"Project & Contract Services","2002-06-30",14,81,135052,61253]
["Parrish, Debra",null,"Project & Contract Services","2009-06-06",7,66,117281,140911]
["Washington, Phillip",null,"Project & Contract Services","2000-12-01",15,26,212183,43361]
["McCullough, Scott",null,"Project & Contract Services","1998-10-09",17,58,234481,53580]
["Warren, Jean",null,"Project & Contract Services","1993-09-09",23,42,229173,244192]
["Craig, Alan",null,"Project & Contract Services","2008-12-16",7,16,36873,45448]
["Flores, Angela",null,"Project & Contract Services","1993-07-27",23,42,44389,293582]
["Clark, William",null,"Project & Contract Services","1999-04-18",17,32,192212,275316]
["Wyatt, Kelly",null,"Project & Contract Services","1996-03-07",20,70,178148,254950]
["Ellison, Melyssa",null,"Project & Contract Services","2001-10-15",14,26,160408,272162]
["Bennett, Chris",null,"Project & Contract Services","2008-03-26",8,82,130515,78355]
["Delgado, Dale",null,"Project & Contract Services","2000-03-06",16,40,280618,84364]
["Brock, Ensley",null,"Project & Contract Services","1999-02-13",17,55,185522,269261]
["Harrell, Cristin",null,"Project & Contract Services","2006-01-20",10,60,54918,207628]
["Houston, Mark",null,"Project & Contract Services","1994-03-20",22,69,203697,184649]
["Maxwell, Jill",null,"Project & Contract Services","2006-12-13",9,65,105007,191300]
["Moreno, Christopher",null,"Project & Contract Services","2005-03-19",11,31,236224,27739]
["Acosta, Robert",null,"Project & Contract Services","2006-02-09",10,50,276564,165579]
["Ramirez, Keith",null,"Project & Contract Services","2001-06-21",15,54,281081,198428]
["Cannon, Jenny",null,"Project & Contract Services","2006-07-08",10,85,128338,270879]
["Rodgers, Daniel",null,"Project & Contract Services","1994-06-07",22,27,278197,236840]
["Schwartz, Joseph",null,"Project & Contract Services","1998-11-17",17,10,66212,195977]
["Guerra, Karen",null,"Project & Contract Services","1993-02-13",23,18,276588,126270]
["Griffin, Debbi",null,"Project & Contract Services","1999-10-11",16,80,207306,214954]
["Boyer, John",null,"Project & Contract Services","2003-09-30",13,84,66637,90839]
["Brown, Donald",null,"Project & Contract Services","2005-09-22",11,69,283940,275169]
["Solis, Daniel",null,"Project & Contract Services","2007-05-06",9,61,210941,102454]
["Allen, Thomas",null,"Project & Contract Services","1996-10-02",20,50,271362,42802]
["Sutton, Matthew",null,"Project & Contract Services","2003-12-15",12,28,31749,297024]
["Garza, Anthony",null,"Project & Contract Services","2003-12-14",12,41,134808,62196]
["Lester, Sherri",null,"Project & Contract Services","2007-06-27",9,85,125438,70660]
["Barron, Michael",null,"Project & Contract Services","1993-12-06",22,35,37251,240844]
["Hickman, John",null,"Project & Contract Services","2000-08-27",16,38,76611,43211]
["Rose, Mark",null,"Project & Contract Services","2001-04-21",15,37,137423,150287]
["Hunter, Lisa",null,"Project & Contract Services","2001-12-31",14,79,101023,41066]
["Sanchez, Greg",null,"Project & Contract Services","1993-11-20",22,15,73605,81289]
["Hammond, Robert",null,"Project & Contract Services","1999-02-07",17,39,265093,225805]
["Pugh, Lawrence",null,"Project & Contract Services","2005-02-21",11,19,76166,135048]
["Mendez, Max",null,"Project & Contract Services","2001-11-27",14,32,152943,144223]
["Hood, Renee",null,"Quality Assurance","2000-12-10",15,46,91302,110576]
["Small, Athanasios",null,"Quality Assurance","2004-07-02",12,71,233531,247863]
["Serrano, Al",null,"Quality Assurance","2001-07-16",15,32,210237,105718]
["Carpenter, Ronald",null,"Quality Assurance","1999-05-13",17,61,165711,73178]
["Gross, Davin",null,"Quality Assurance","1998-10-29",17,84,119036,220588]
["Smith, Koleen",null,"Quality Assurance","1995-02-13",21,17,274568,140638]
["Keith, Thomas",null,"Quality Assurance","1998-12-22",17,14,119501,252760]
["Cain, Lon",null,"Quality Assurance","2007-09-09",9,18,112064,68259]
["Henderson, Anthony",null,"Quality Assurance","1997-04-27",19,77,158832,235350]
["Rojas, Charles",null,"Quality Assurance","1995-12-14",20,79,115065,85748]
["Watson, Christian",null,"Quality Assurance","2005-07-01",11,15,79592,188766]
["Douglas, Kenneth",null,"Quality Assurance","2001-01-12",15,20,270477,172342]
["Williamson, Sumedha",null,"Quality Assurance","2008-02-24",8,24,231612,91749]
["Myers, Marc",null,"Quality Assurance","1995-05-28",21,33,266366,133852]
["Oneal, William",null,"Quality Assurance","2000-06-21",16,61,283006,113179]
["Miller, Jessica",null,"Quality Assurance","2002-04-18",14,85,252122,279816]
["Zimmerman, Julian",null,"Quality Assurance","2006-07-24",10,34,176750,123862]
["Campbell, Michael",null,"Quality Assurance","2003-12-30",12,70,218996,119079]
["Hanson, Dennis",null,"Quality Assurance","1995-06-15",21,78,166239,70429]
["Love, Danny",null,"Quality Assurance","1994-12-16",21,29,70867,207802]
["Oconnor, Kent",null,"Quality Assurance","2004-06-29",12,46,280862,72674]
["Ashley, Michael",null,"Quality Assurance","2002-01-26",14,66,158252,139191]
["Christensen, Jill",null,"Quality Assurance","2002-07-25",14,57,281379,50222]
["Stone, Brian",null,"Quality Assurance","2009-06-23",{"$f":"DATEDIF(D578,TODAY(),\"Y\")","v":7},37,107531,209036]
["Fernandez, Marie",null,"Quality Assurance","2007-03-19",9,69,233774,140077]
["McKenzie, Michelle",null,"Quality Assurance","2005-11-02",10,81,226857,245542]
["Fischer, David",null,"Quality Assurance","2003-06-13",13,71,176067,117999]
["Fitzgerald, George",null,"Quality Assurance","1996-02-13",20,84,215896,192130]
["Shepherd, Annie",null,"Quality Assurance","2008-10-24",7,27,152764,255051]
["Trujillo, Shawn",null,"Quality Assurance","2002-04-04",14,17,213322,192293]
["Best, Lara",null,"Quality Assurance","1996-02-12",20,68,92554,233468]
["Gregory, Jon",null,"Quality Assurance","2004-08-20",12,43,147012,216925]
["McKee, Michelle",null,"Quality Assurance","1994-01-14",22,88,266910,204508]
["Mitchell, Shannon",null,"Quality Assurance","2006-07-14",10,27,76685,253045]
["Nelson, Shira",null,"Quality Assurance","2002-05-18",14,42,140884,231043]
["Diaz, David",null,"Quality Assurance","2006-03-29",10,81,111159,154831]
["Shelton, Donna",null,"Quality Assurance","2001-11-09",14,71,159942,262562]
["Harrison, Jonathan",null,"Quality Assurance","1994-03-30",22,31,40397,183802]
["Castillo, Sheri",null,"Quality Assurance","1994-03-31",22,60,237474,296301]
["Patterson, Robert",null,"Quality Assurance","1999-01-23",17,29,85115,219008]
["Thompson, John",null,"Quality Assurance","2007-07-17",9,61,210717,112944]
["McIntosh, Jeremy",null,"Quality Assurance","2002-12-17",13,22,147932,134780]
["Higgins, Angela",null,"Quality Assurance","2007-03-09",9,66,187375,179782]
["Cook, Mark",null,"Quality Assurance","2008-09-25",8,35,226828,150057]
["Martin, Terry",null,"Quality Assurance","2005-06-06",11,43,203435,113514]
["Pope, Duane",null,"Quality Assurance","2007-10-04",9,39,48879,174485]
["Malone, Daniel",null,"Quality Assurance","1999-08-28",17,85,197026,199541]
["Larson, David",null,"Quality Assurance","1996-09-06",20,86,186149,183448]
["Mercado, David",null,"Quality Assurance","1999-04-04",17,30,66136,139877]
["Woodward, Timothy",null,"Quality Assurance","1998-12-25",17,24,32517,267051]
["Rich, Brent",null,"Quality Assurance","1994-06-03",22,40,152885,250925]
["Durham, Troy",null,"Quality Assurance","1999-09-14",17,59,113100,240745]
["Livingston, Lynette",null,"Quality Assurance","2004-12-20",11,55,273837,44355]
["Woodard, Charles",null,"Quality Assurance","1994-12-18",21,14,173670,203621]
["Reid, Elizabeth",null,"Quality Assurance","2007-09-19",9,68,54257,35788]
["Manning, John",null,"Quality Assurance","1995-10-12",20,80,274748,226695]
["Bowers, Tammy",null,"Quality Assurance","2000-02-03",16,79,189506,130609]
["Whitehead, Carolyn",null,"Quality Assurance","1994-10-17",21,68,26834,256518]
["Frank, William",null,"Quality Assurance","2005-03-01",11,54,189823,230752]
["Davenport, Troy",null,"Quality Assurance","2004-08-01",12,73,65571,231629]
["Olson, Melanie",null,"Quality Assurance","2003-01-15",13,54,210622,137155]
["Clay, William",null,"Quality Assurance","1993-11-12",22,54,98626,172703]
["Eaton, Cris",null,"Quality Assurance","1996-07-28",20,54,298950,240844]
["Romero, Randy",null,"Quality Assurance","2000-11-19",15,52,217454,54414]
["Page, Lisa",null,"Quality Assurance","2003-01-16",13,86,154899,68728]
["Graham, David",null,"Quality Assurance","1993-10-01",23,56,113827,183316]
["Watts, Curtis",null,"Quality Assurance","2008-05-15",8,38,279286,225092]
["Lucas, John",null,"Quality Assurance","2007-09-25",9,79,161309,178516]
["Herrera, Shawn",null,"Quality Assurance","2006-01-20",10,39,295987,143326]
["Strong, Lisa",null,"Quality Assurance","1999-09-29",17,38,299317,30914]
["Marsh, Cynthia",null,"Quality Assurance","1999-07-19",17,16,110333,93915]
["Guzman, Don",null,"Quality Assurance","2004-07-10",12,31,233817,142885]
["Estrada, Joan",null,"Quality Assurance","1998-04-28",18,37,117623,245021]
["Cruz, Janene",null,"Quality Control","2005-11-25",10,15,120183,52214]
["Woods, Marcus",null,"Quality Control","2008-04-14",8,42,254483,202825]
["Norton, Bruce",null,"Quality Control","1993-12-06",22,65,217399,167618]
["Hines, Herb",null,"Quality Control","2007-08-30",9,54,33227,63645]
["Marshall, Anita",null,"Quality Control","2008-06-11",8,74,189502,276065]
["Bowman, Michael",null,"Quality Control","1996-08-29",20,39,255376,187902]
["Banks, Ryan",null,"Quality Control","1999-07-26",17,33,100886,187908]
["Lowery, Charles",null,"Quality Control","1994-06-24",22,32,135828,108677]
["Erickson, Ricky",null,"Quality Control","1997-08-28",19,19,243009,49413]
["Padilla, Christopher",null,"Quality Control","2004-05-19",12,68,115943,254186]
["Ayala, Polly",null,"Quality Control","2001-06-17",15,64,178941,81589]
["York, Steven",null,"Quality Control","1996-04-16",20,53,121629,279116]
["Little, Steve",null,"Quality Control","2009-04-25",7,68,122128,115631]
["Gates, Anne",null,"Quality Control","2000-05-03",16,28,192083,174919]
["Blackburn, Kathryn",null,"Quality Control","2003-01-31",{"$f":"DATEDIF(D642,TODAY(),\"Y\")","v":13},19,210312,109685]
["Howell, Douglas",null,"Quality Control","2004-07-21",12,11,139724,226415]
["Paul, Michael",null,"Quality Control","2006-01-22",10,20,104849,260994]
["Knox, Lori",null,"Quality Control","1995-01-31",21,67,39999,255315]
["Hardin, Gregory",null,"Quality Control","1993-08-22",23,58,287671,163651]
["Silva, Stephen",null,"Quality Control","1999-12-24",16,48,267603,269313]
["Robinson, John",null,"Quality Control","2005-11-13",10,46,142994,249537]
["Stanley, Eric",null,"Quality Control","2007-09-29",9,48,155610,170024]
["Walters, Ann",null,"Quality Control","1997-12-04",18,38,294051,121726]
["Hartman, Michael",null,"Quality Control","2008-10-19",7,72,61381,239167]
["Steele, Gerald",null,"Quality Control","1997-03-03",19,23,229450,132663]
["Stephenson, Matthew",null,"Quality Control","2002-11-12",13,56,157788,99670]
["Benson, Troy",null,"Quality Control","1994-01-22",22,23,67723,156907]
["Curtis, Patrick",null,"Quality Control","2000-03-05",16,49,59513,95468]
["Dean, Gayla",null,"Quality Control","1995-12-29",20,65,283287,208977]
["Holland, Donald",null,"Quality Control","2006-08-26",10,76,268580,199421]
["Everett, Dan",null,"Quality Control","1994-11-13",21,81,228909,223630]
["Barr, Jennifer",null,"Quality Control","2004-03-02",12,41,213873,156269]
["Blackwell, Brandon",null,"Quality Control","2008-02-04",8,84,225754,106927]
["Rivera, Timothy",null,"Quality Control","2006-05-16",10,21,275473,259350]
["Branch, Brady",null,"Quality Control","1994-10-25",21,56,109430,43196]
["Shields, Robert",null,"Quality Control","2003-06-02",13,21,106713,104477]
["Andrews, Diane",null,"Quality Control","2002-01-09",14,21,248577,150588]
["Aguilar, Kevin",null,"Quality Control","1999-03-02",17,87,270751,219192]
["Wise, Ted",null,"Quality Control","1995-12-28",20,67,175001,53792]
["Marquez, Thomas",null,"Quality Control","1994-01-12",22,39,143021,107199]
["Roth, Tony",null,"Quality Control","1993-06-23",23,43,148342,246721]
["Wagner, Lynne",null,"Quality Control","2005-06-14",11,16,68403,51005]
["Griffith, Michelle",null,"Quality Control","2001-08-22",15,45,49060,132100]
["Newman, Aria",null,"Quality Control","2002-02-18",14,44,105917,56975]
["Blake, Thomas",null,"Quality Control","2003-08-26",13,13,240379,279932]
["Lara, Mark",null,"Quality Control","2006-09-04",10,12,144811,198883]
["Meyer, Charles",null,"Quality Control","1994-12-09",21,28,167354,297745]
["Murphy, Jeff",null,"Quality Control","1993-11-25",22,50,35506,212901]
["Hutchinson, Robin",null,"Quality Control","2003-11-27",12,60,174683,33788]
["Chen, Jaime",null,"Quality Control","2006-03-16",10,85,230640,149933]
["Ortega, Jeffrey",null,"Quality Control","2007-07-21",9,48,158513,147564]
["Wong, Dennis",null,"Quality Control","2009-05-12",7,67,157428,289481]
["Daniels, Janet",null,"Quality Control","1998-09-26",18,77,154181,63636]
["Kelly, Icelita",null,"Quality Control","1995-03-28",21,87,133813,169296]
["Morales, Linda",null,"Quality Control","1999-12-09",16,51,193867,43163]
["Parsons, Phillip",null,"Quality Control","1998-03-05",18,32,172804,268169]
["Hess, Brian",null,"Quality Control","1998-06-14",18,31,199581,31746]
["Peterson, Shaun",null,"Quality Control","1993-09-06",23,20,173696,288735]
["Herman, Henrietta",null,"Quality Control","1994-05-05",22,43,54909,226247]
["McCall, Keith",null,"Quality Control","1997-01-25",19,24,49309,150810]
["Brewer, Khurrum",null,"Quality Control","1997-04-16",19,31,116825,34179]
["Massey, Mark",null,"Quality Control","1998-02-24",18,26,276443,200381]
["Daniel, Robert",null,"Quality Control","1997-12-18",18,74,260293,84094]
["Glass, John",null,"Quality Control","1993-11-16",22,49,51603,151901]
["Marks, LaReina",null,"Quality Control","1994-07-18",22,60,59403,55641]
["Bruce, Kevin",null,"Quality Control","2002-07-27",14,32,38454,72013]
["Pennington, Gary",null,"Quality Control","2005-11-15",10,23,68257,137011]
["Winters, Shaun",null,"Quality Control","1993-11-14",22,31,254545,200409]
["Brooks, Richard",null,"Quality Control","1999-02-19",17,30,274508,175599]
["Mosley, Michael",null,"Quality Control","1993-03-01",23,73,239692,50026]
["Hensley, William",null,"Quality Control","2003-05-15",13,46,210934,63631]
["Hale, Deon",null,"Quality Control","1997-12-29",18,39,96643,122938]
["Middleton, Jen",null,"Quality Control","2008-11-16",7,64,68945,118089]
["Santos, Garret",null,"Quality Control","2001-11-28",14,60,127922,130648]
["Moran, Carol",null,"Quality Control","1996-03-20",20,71,177485,246196]
["Clarke, Dennis",null,"Quality Control","2001-05-26",15,24,64191,273338]
["Jensen, Kristina",null,"Quality Control","1996-03-05",20,35,256980,267630]
["Lynch, Scott",null,"Quality Control","2003-05-12",13,15,51121,109534]
["Quinn, Cinnamon",null,"Quality Control","1996-08-17",{"$f":"DATEDIF(D706,TODAY(),\"Y\")","v":20},82,296245,245685]
["Combs, Rick",null,"Quality Control","1993-10-10",22,45,186854,275487]
["Hopkins, Lisa",null,"Quality Control","2008-07-14",8,10,145103,137923]
["Simpson, Jimmy",null,"Quality Control","1999-07-07",17,48,62959,165756]
["Rhodes, Brenda",null,"Quality Control","1996-03-19",20,72,69740,246897]
["Baldwin, Ray",null,"Quality Control","2000-01-07",16,33,182910,278587]
["Haynes, Ernest",null,"Quality Control","2006-07-09",10,13,33929,290904]
["Rios, Fredrick",null,"Quality Control","2006-01-26",10,11,219915,165687]
["Torres, Bruce",null,"Quality Control","2004-08-30",12,40,48819,70047]
["Reed, Larry",null,"Quality Control","2007-05-10",9,66,254614,295211]
["Roberts, Jackie",null,"Quality Control","1994-05-13",22,82,248212,166499]
["Buchanan, Dennis",null,"Quality Control","1999-02-27",17,14,257159,295163]
["Booth, Raquel",null,"Quality Control","1996-02-23",20,42,290523,93975]
["Bryant, Douglas",null,"Quality Control","1996-03-13",20,79,129021,224857]
["Berry, Jacklyn",null,"Quality Control","2005-04-27",11,81,132017,50246]
["Fowler, John",null,"Quality Control","1999-02-15",17,65,201306,294722]
["Johns, Chad",null,"Research Center","2001-05-07",15,32,168032,116384]
["Rodriquez, Denise",null,"Research Center","1994-11-15",21,56,72922,110259]
["Sweeney, Barbara",null,"Research Center","1997-10-16",18,81,275661,254861]
["Warner, Stephen",null,"Research Center","2002-03-27",14,71,162491,162670]
["Arnold, Cole",null,"Research Center","1995-10-26",20,30,136345,292782]
["Sherman, Karin",null,"Research/Development","2000-09-09",16,29,191320,186463]
["Garcia, Karen",null,"Research/Development","2004-01-02",12,64,207535,68645]
["Campos, Richard",null,"Research/Development","1994-02-17",22,34,49175,222799]
["Owens, Dwight",null,"Research/Development","1996-06-16",20,40,218537,105725]
["Guerrero, Laura",null,"Research/Development","2006-01-25",10,76,245505,191860]

{"sheet":"Sheet2","index":1,"n_rows":1074,"n_cols":11,"rows_kept":1074,"cut":false,"hidden":false,"merged":[]}
["AuthorID","Initial\nContract Date","Years\nUnder Contract","Number of\nBooks in Print","Number of\nBooks Sold","Sell\nPrice","Income\nEarned","Early\nProducer?","5+ Years\nor High\nProducer?","5+ Years\nand 350K+ Units\nSold or $1M+ Earned?","Royalty\nRate"]
[1005,"2011-01-21",1.3963039014373717,25,529115,7.99,{"$f":"Number_of_Books_Sold*Sell_Price","v":4227628.8500000006},{"$f":"IF(AND(Years_Under_Contract<2,Number_of_Books_in_Print>4)=TRUE,\"Yes\",\"No\")","v":"Yes"},{"$f":"IF(OR(Years_Under_Contract>5,Number_of_Books_in_Print>=10)=TRUE,\"Yes\",\"No\")","v":"Yes"},{"$f":"IF(AND(Years_Under_Contract>5,OR(Number_of_Books_in_Print>350000,Income_Earned>=1000000))=TRUE,\"Yes\",\"No\")","v":"No"},{"$f":"IF(AND(Years_Under_Contract>5,OR(Number_of_Books_in_Print>10,Income_Earned>1000000)),0.2,IF(Number_of_Books_in_Print>10,0.15,0.09))","v":0.15}]
[1006,"2000-10-15",11.663244353182751,3,105627,7,{"$f":"Number_of_Books_Sold*Sell_Price","v":739389},"No","Yes","No",0.09]
[1008,"2010-04-12",2.1738535249828885,6,58770,2.99,175722.30000000002,"No","No","No",0.09]
[1011,"2001-09-24",10.721423682409309,11,73265,3.99,292327.35000000003,"No","Yes","No",0.2]
[1012,"2009-05-17",3.077344284736482,13,511768,2.99,1530186.32,"No","Yes","No",0.15]
[1013,"2006-10-16",5.6618754277891856,18,643517,5.99,3854666.83,"No","Yes","Yes",0.2]
[1013,"2003-07-22",8.8980150581793289,8,194127,7.99,1551074.73,"No","Yes","Yes",0.2]
[1014,"2006-03-07",6.2724161533196439,9,268650,15.99,4295713.5,"No","Yes","Yes",0.2]
[1015,"2009-05-03",3.1156741957563314,4,479764,3.99,1914258.36,"No","No","No",0.09]
[1015,"2011-08-16",0.82956878850102667,6,86089,10.99,946118.11,"Yes","No","No",0.09]
[1016,"2000-04-02",12.199863107460644,10,474253,10.99,5212040.47,"No","Yes","Yes",0.2]
[1017,"2011-03-22",1.2320328542094456,6,59438,23.99,1425917.6199999999,"Yes","No","No",0.09]
[1029,"2002-12-25",9.4702258726899391,21,352477,9.99,3521245.23,"No","Yes","Yes",0.2]
[1029,"2005-09-09",6.7624914442162902,14,559978,9.99,5594180.2199999997,"No","Yes","Yes",0.2]
[1032,"2006-01-06",6.4366872005475706,25,595341,5.99,3566092.5900000003,"No","Yes","Yes",0.2]
[1033,"2000-11-29",11.540041067761807,18,320612,2.99,958629.88000000012,"No","Yes","No",0.2]
[1034,"2012-02-06",0.35318275154004108,9,269443,10.99,2961178.57,"Yes","No","No",0.09]
[1034,"2002-01-17",10.406570841889117,25,26430,10.99,290465.7,"No","Yes","No",0.2]
[1034,"2005-12-30",6.4558521560574951,19,208998,5.99,1251898.02,"No","Yes","Yes",0.2]
[1034,"2007-11-22",4.561259411362081,1,246559,5.99,1476888.4100000001,"No","No","No",0.09]
[1037,"2000-07-01",11.953456536618754,10,677940,7.99,5416740.6000000006,"No","Yes","Yes",0.2]
[1038,"2002-03-09",10.266940451745381,25,429973,12.99,5585349.2700000005,"No","Yes","Yes",0.2]
[1039,"2005-04-20",7.1512662559890483,14,32090,5.99,192219.1,"No","Yes","No",0.2]
[1040,"2005-06-28",6.9623545516769338,21,150897,7.99,1205667.03,"No","Yes","Yes",0.2]
[1042,"2007-03-20",5.2375085557837098,15,600871,2.99,1796604.29,"No","Yes","Yes",0.2]
[1048,"2001-12-13",10.50239561943874,13,269172,5.99,1612340.28,"No","Yes","Yes",0.2]
[1049,"2002-04-04",10.195756331279945,11,266381,10.99,2927527.19,"No","Yes","Yes",0.2]
[1055,"2007-05-02",5.1197809719370291,7,248775,2.99,743837.25,"No","Yes","No",0.09]
[1056,"2010-05-20",2.0698151950718686,24,128922,23.99,3092838.78,"No","Yes","No",0.15]
[1057,"2000-11-17",11.572895277207392,22,314930,12.99,4090940.7,"No","Yes","Yes",0.2]
[1062,"2004-01-13",8.4188911704312108,18,163707,12.99,2126553.9300000002,"No","Yes","Yes",0.2]
[1063,"2008-03-17",4.2436687200547567,7,202036,7.99,1614267.6400000001,"No","No","No",0.09]
[1065,"2001-09-18",10.737850787132102,5,635933,2.99,1901439.6700000002,"No","Yes","Yes",0.2]
[1066,"2002-09-18",9.7385352498288835,21,440249,2.99,1316344.51,"No","Yes","Yes",0.2]
[1067,"2012-02-27",0.29568788501026694,21,488211,10.99,5365438.8899999997,"Yes","Yes","No",0.15]
[1068,"2004-01-18",8.4052019164955514,5,233679,5.99,1399737.21,"No","Yes","Yes",0.2]
[1069,"2005-05-11",7.0937713894592749,5,647964,2.99,1937412.36,"No","Yes","Yes",0.2]
[1069,"2001-04-15",11.16495550992471,23,502085,2.99,1501234.1500000001,"No","Yes","Yes",0.2]
[1070,"2002-07-21",9.9000684462696782,24,297144,7.99,2374180.56,"No","Yes","Yes",0.2]
[1076,"2007-03-15",5.2511978097193701,20,330616,12.99,4294701.84,"No","Yes","Yes",0.2]
[1077,"2006-12-02",5.5331964407939767,10,582250,5.99,3487677.5,"No","Yes","Yes",0.2]
[1078,"2000-04-22",12.145106091718,1,580635,15.99,9284353.6500000004,"No","Yes","Yes",0.2]
[1079,"2007-03-10",5.2648870636550305,7,483051,10.99,5308730.49,"No","Yes","Yes",0.2]
[1079,"2012-01-23",0.39151266255989048,14,271821,23.99,6520985.79,"Yes","Yes","No",0.15]
[1081,"2005-03-02",7.2854209445585214,14,132674,15.99,2121457.2600000002,"No","Yes","Yes",0.2]
[1085,"2009-07-03",2.9486652977412731,9,127515,7.99,1018844.85,"No","No","No",0.09]
[1085,"2006-10-14",5.6673511293634498,7,233394,15.99,3731970.06,"No","Yes","Yes",0.2]
[1086,"2007-10-18",4.6570841889117043,19,207590,3.99,828284.10000000009,"No","Yes","No",0.15]
[1095,"2009-11-07",2.6009582477754964,15,51705,15.99,826762.95,"No","Yes","No",0.15]
[1096,"2004-11-04",7.6084873374401099,21,213641,3.99,852427.59000000008,"No","Yes","No",0.2]
[1097,"2002-01-12",10.420260095824778,18,113257,7.99,904923.43,"No","Yes","No",0.2]
[1100,"2001-09-17",10.740588637919233,3,457774,5.99,2742066.2600000002,"No","Yes","Yes",0.2]
[1100,"2001-04-27",11.132101300479125,11,416639,12.99,5412140.6100000003,"No","Yes","Yes",0.2]
[1105,"2011-05-03",1.1170431211498972,10,279860,2.99,836781.4,"Yes","Yes","No",0.09]
[1109,"2008-05-20",4.0684462696783026,16,226985,15.99,3629490.15,"No","Yes","No",0.15]
[1110,"2001-09-22",10.726899383983573,20,232730,5.99,1394052.7,"No","Yes","Yes",0.2]
[1110,"2009-10-27",2.6310746064339492,24,251515,10.99,2764149.85,"No","Yes","No",0.15]
[1116,"2011-06-20",0.98562628336755642,14,249249,10.99,2739246.5100000002,"Yes","Yes","No",0.15]
[1124,"2007-05-06",5.1088295687885008,7,253704,2.99,758574.96000000008,"No","Yes","No",0.09]
[1127,"2011-06-26",0.9691991786447639,1,34730,15.99,555332.69999999995,"No","No","No",0.09]
[1128,"2006-01-19",6.4010951403148528,13,455584,10.99,5006868.16,"No","Yes","Yes",0.2]
[1129,"2011-08-16",0.82956878850102667,1,292202,15.99,4672309.9800000004,"No","No","No",0.09]
[1132,"2009-01-17",3.4058863791923342,20,522747,2.99,1563013.53,"No","Yes","No",0.15]
[1133,"2004-01-29",8.3750855578370977,23,434586,12.99,5645272.1399999997,"No","Yes","Yes",0.2]
[1135,"2009-06-15",2.9979466119096507,10,5247,9.99,{"$f":"Number_of_Books_Sold*Sell_Price","v":52417.53},{"$f":"IF(AND(Years_Under_Contract<2,Number_of_Books_in_Print>4)=TRUE,\"Yes\",\"No\")","v":"No"},{"$f":"IF(OR(Years_Under_Contract>5,Number_of_Books_in_Print>=10)=TRUE,\"Yes\",\"No\")","v":"Yes"},{"$f":"IF(AND(Years_Under_Contract>5,OR(Number_of_Books_in_Print>350000,Income_Earned>=1000000))=TRUE,\"Yes\",\"No\")","v":"No"},{"$f":"IF(AND(Years_Under_Contract>5,OR(Number_of_Books_in_Print>10,Income_Earned>1000000)),0.2,IF(Number_of_Books_in_Print>10,0.15,0.09))","v":0.09}]
[1140,"2000-04-25",12.136892539356605,19,590042,5.99,3534351.58,"No","Yes","Yes",0.2]
[1146,"2009-01-02",3.4469541409993156,15,510292,10.99,5608109.0800000001,"No","Yes","No",0.15]
[1147,"2009-10-30",2.622861054072553,13,275336,12.99,3576614.64,"No","Yes","No",0.15]
[1149,"2004-09-14",7.7481177275838471,15,128092,9.99,1279639.08,"No","Yes","Yes",0.2]
[1155,"2004-06-29",7.9589322381930181,4,326167,15.99,5215410.33,"No","Yes","Yes",0.2]
[1156,"2000-01-29",12.375085557837098,21,333542,23.99,8001672.5799999991,"No","Yes","Yes",0.2]
[1158,"2008-01-14",4.4161533196440796,5,298230,5.99,1786397.7,"No","No","No",0.09]
[1158,"2004-07-01",7.953456536618754,3,265284,10.99,2915471.16,"No","Yes","Yes",0.2]
[1162,"2000-12-03",11.529089664613279,11,534370,3.99,2132136.3000000003,"No","Yes","Yes",0.2]
[1164,"2003-06-14",9.0020533880903493,21,347737,9.99,3473892.63,"No","Yes","Yes",0.2]
[1164,"2007-05-12",5.0924024640657084,1,227933,10.99,2504983.67,"No","Yes","Yes",0.2]
[1168,"2010-05-03",2.1163586584531142,23,112108,2.99,335202.92000000004,"No","Yes","No",0.15]
[1170,"2002-10-19",9.6536618754277885,9,286562,7.99,2289630.38,"No","Yes","Yes",0.2]
[1171,"2012-06-06",2.190280629705681E-2,13,532758,7.99,4256736.42,"Yes","Yes","No",0.15]
[1171,"2001-12-03",10.529774127310061,12,345313,12.99,4485615.87,"No","Yes","Yes",0.2]
[1174,"2006-02-25",6.2997946611909654,15,517922,7.99,4138196.7800000003,"No","Yes","Yes",0.2]
[1175,"2002-05-25",10.056125941136209,18,102223,15.99,1634545.77,"No","Yes","Yes",0.2]
[1177,"2005-01-25",7.3839835728952776,7,140897,12.99,1830252.03,"No","Yes","Yes",0.2]
[1178,"2008-06-28",3.9616700889801506,8,296154,2.99,885500.46000000008,"No","No","No",0.09]
[1180,"2011-08-31",0.7885010266940452,24,545464,15.99,8721969.3599999994,"Yes","Yes","No",0.15]
[1180,"2006-04-11",6.1765913757700206,10,411812,7.99,3290377.88,"No","Yes","Yes",0.2]
[1181,"2002-04-13",10.171115674195756,1,93331,9.99,932376.69000000006,"No","Yes","No",0.09]
[1186,"2010-03-16",2.2477754962354553,8,12753,5.99,76390.47,"No","No","No",0.09]
[1187,"2003-12-20",8.4845995893223822,19,464156,7.99,3708606.44,"No","Yes","Yes",0.2]
[1188,"2002-04-09",10.182067077344286,6,659893,5.99,3952759.0700000003,"No","Yes","Yes",0.2]
[1189,"2001-10-17",10.658453114305271,6,289753,3.99,1156114.47,"No","Yes","Yes",0.2]
[1190,"2003-12-07",8.5201916495551,5,201152,2.99,601444.4800000001,"No","Yes","No",0.09]
[1193,"2011-06-12",1.0075290896646132,24,237114,2.99,708970.8600000001,"Yes","Yes","No",0.15]
[1194,"2006-06-24",5.9739904175222449,12,39296,10.99,431863.04000000004,"No","Yes","No",0.2]
[1195,"2007-06-30",4.9582477754962353,14,420731,15.99,6727488.6900000004,"No","Yes","No",0.15]
[1196,"2010-05-03",2.1163586584531142,11,337317,12.99,4381747.83,"No","Yes","No",0.15]
[1198,"2001-07-23",10.89390828199863,15,291960,7.99,2332760.4,"No","Yes","Yes",0.2]
[1199,"2004-09-04",7.7754962354551678,19,417856,12.99,5427949.4400000004,"No","Yes","Yes",0.2]
[1202,"2008-09-22",3.7262149212867897,20,15768,2.99,47146.320000000007,"No","Yes","No",0.15]
[1202,"2004-01-22",8.3942505133470231,19,439551,9.99,4391114.49,"No","Yes","Yes",0.2]
[1205,"2008-06-16",3.9945242984257359,2,386692,5.99,2316285.08,"No","No","No",0.09]
[1209,"2008-07-08",3.9342915811088295,12,492342,10.99,5410838.5800000001,"No","Yes","No",0.15]
[1211,"2001-10-24",10.639288158795345,20,645052,2.99,1928705.4800000002,"No","Yes","Yes",0.2]
[1216,"2008-10-25",3.6358658453114305,14,442285,10.99,4860712.1500000004,"No","Yes","No",0.15]
[1217,"2007-03-01",5.28952772073922,13,637136,12.99,8276396.6400000006,"No","Yes","Yes",0.2]
[1225,"2010-05-17",2.0780287474332648,1,216279,23.99,5188533.21,"No","No","No",0.09]
[1225,"2003-08-11",8.8432580424366876,19,253674,9.99,2534203.2600000002,"No","Yes","Yes",0.2]
[1226,"2000-09-03",11.7782340862423,2,155218,12.99,2016281.82,"No","Yes","Yes",0.2]
[1230,"2000-07-17",11.909650924024641,7,663594,9.99,6629304.0600000005,"No","Yes","Yes",0.2]
[1230,"2001-08-29",10.792607802874743,3,401563,9.99,4011614.37,"No","Yes","Yes",0.2]
[1232,"2002-12-08",9.5167693360711834,13,125672,2.99,375759.28,"No","Yes","No",0.2]
[1234,"2000-03-19",12.238193018480493,7,324523,15.99,5189122.7700000005,"No","Yes","Yes",0.2]
[1235,"2005-02-14",7.3292265571526354,16,324362,12.99,4213462.38,"No","Yes","Yes",0.2]
[1236,"2004-02-01",8.3668720054757024,21,50258,2.99,150271.42000000001,"No","Yes","No",0.2]
[1237,"2010-01-08",2.431211498973306,20,150537,12.99,1955475.6300000001,"No","Yes","No",0.15]
[1238,"2005-05-04",7.1129363449691994,4,515774,2.99,1542164.26,"No","Yes","Yes",0.2]
[1239,"2001-07-10",10.929500342231348,16,70232,12.99,912313.68,"No","Yes","No",0.2]
[1241,"2004-12-24",7.4715947980835047,8,471625,10.99,5183158.75,"No","Yes","Yes",0.2]
[1241,"2000-09-14",11.748117727583846,6,354867,12.99,4609722.33,"No","Yes","Yes",0.2]
[1243,"2005-11-20",6.5653661875427787,1,429724,15.99,6871286.7599999998,"No","Yes","Yes",0.2]
[1244,"2010-11-22",1.5605749486652978,4,238155,2.99,712083.45000000007,"No","No","No",0.09]
[1245,"2002-04-29",10.127310061601642,10,504049,2.99,1507106.51,"No","Yes","Yes",0.2]
[1246,"2009-11-06",2.6036960985626285,23,632994,2.99,1892652.06,"No","Yes","No",0.15]
[1254,"2001-04-08",11.184120465434633,23,268080,3.99,1069639.2,"No","Yes","Yes",0.2]
[1256,"2005-06-07",7.0198494182067082,3,573735,2.99,1715467.6500000001,"No","Yes","Yes",0.2]
[1258,"2010-11-26",1.5496235455167693,1,489499,23.99,11743081.01,"No","No","No",0.09]
[1262,"2008-08-09",3.8466803559206024,14,265481,2.99,793788.19000000006,"No","Yes","No",0.15]
[1265,"2009-06-24",2.9733059548254621,16,165210,9.99,1650447.9000000001,"No","Yes","No",0.15]
[1267,"2005-01-07",7.4332648870636548,18,110821,9.99,{"$f":"Number_of_Books_Sold*Sell_Price","v":1107101.79},{"$f":"IF(AND(Years_Under_Contract<2,Number_of_Books_in_Print>4)=TRUE,\"Yes\",\"No\")","v":"No"},{"$f":"IF(OR(Years_Under_Contract>5,Number_of_Books_in_Print>=10)=TRUE,\"Yes\",\"No\")","v":"Yes"},{"$f":"IF(AND(Years_Under_Contract>5,OR(Number_of_Books_in_Print>350000,Income_Earned>=1000000))=TRUE,\"Yes\",\"No\")","v":"Yes"},{"$f":"IF(AND(Years_Under_Contract>5,OR(Number_of_Books_in_Print>10,Income_Earned>1000000)),0.2,IF(Number_of_Books_in_Print>10,0.15,0.09))","v":0.2}]
[1272,"2009-07-27",2.8829568788501025,20,514158,23.99,12334650.42,"No","Yes","No",0.15]
[1273,"2000-05-05",12.109514031485284,12,461793,7.99,3689726.0700000003,"No","Yes","Yes",0.2]
[1275,"2008-04-09",4.1806981519507183,19,305300,2.99,912847.00000000012,"No","Yes","No",0.15]
[1275,"2009-08-19",2.8199863107460645,2,229018,2.99,684763.82000000007,"No","No","No",0.09]
[1276,"2011-04-30",1.1252566735112937,19,30490,15.99,487535.10000000003,"Yes","Yes","No",0.15]
[1276,"2009-01-25",3.3839835728952772,14,233741,9.99,2335072.59,"No","Yes","No",0.15]
[1276,"2007-08-27",4.7994524298425736,22,489466,12.99,6358163.3399999999,"No","Yes","No",0.15]
[1277,"2004-12-06",7.5208761122518819,11,97109,7.99,775900.91,"No","Yes","No",0.2]
[1280,"2006-09-11",5.7577002053388089,10,117698,10.99,1293501.02,"No","Yes","Yes",0.2]
[1281,"2009-04-19",3.1540041067761808,9,541856,5.99,3245717.44,"No","No","No",0.09]
[1284,"2012-06-09",1.3689253935660506E-2,18,416726,10.99,4579818.74,"Yes","Yes","No",0.15]
[1288,"2000-10-31",11.619438740588638,12,141949,7.99,1134172.51,"No","Yes","Yes",0.2]
[1288,"2005-06-28",6.9623545516769338,10,286613,3.99,1143585.8700000001,"No","Yes","Yes",0.2]
[1288,"2008-11-11",3.5893223819301849,10,376904,7.99,3011462.96,"No","Yes","No",0.09]
[1290,"2003-12-20",8.4845995893223822,7,536516,12.99,6969342.8399999999,"No","Yes","Yes",0.2]
[1291,"2008-11-21",3.5619438740588638,25,588657,2.99,1760084.4300000002,"No","Yes","No",0.15]
[1300,"2001-09-15",10.746064339493497,22,554316,5.99,3320352.8400000003,"No","Yes","Yes",0.2]
[1301,"2001-12-13",10.50239561943874,9,557976,10.99,6132156.2400000002,"No","Yes","Yes",0.2]
[1304,"2003-03-25",9.2238193018480494,9,529837,2.99,1584212.6300000001,"No","Yes","Yes",0.2]
[1310,"2007-05-17",5.0787132101300481,11,496885,7.99,3970111.15,"No","Yes","Yes",0.2]
[1314,"2002-08-13",9.8370978781656397,2,24857,12.99,322892.43,"No","Yes","No",0.09]
[1315,"2011-12-29",0.45995893223819301,20,4255,9.99,42507.450000000004,"Yes","Yes","No",0.15]
[1316,"2011-08-07",0.85420944558521561,6,567466,3.99,2264189.3400000003,"Yes","No","No",0.09]
[1318,"2005-07-24",6.8911704312114992,10,454193,2.99,1358037.07,"No","Yes","Yes",0.2]
[1318,"2011-02-06",1.352498288843258,1,291612,2.99,871919.88,"No","No","No",0.09]
[1319,"2010-10-04",1.6947296372347707,16,434312,12.99,5641712.8799999999,"Yes","Yes","No",0.15]
[1319,"2005-12-17",6.491444216290212,4,577207,3.99,2303055.9300000002,"No","Yes","Yes",0.2]
[1320,"2011-06-09",1.0157426420260096,10,401992,3.99,1603948.08,"Yes","Yes","No",0.09]
[1322,"2006-07-17",5.9110198494182065,2,589764,5.99,3532686.3600000003,"No","Yes","Yes",0.2]
[1323,"2008-12-01",3.5345653661875427,22,681022,7.99,5441365.7800000003,"No","Yes","No",0.15]
[1324,"2007-12-17",4.4928131416837784,23,465514,3.99,1857400.86,"No","Yes","No",0.15]
[1325,"2010-12-12",1.5058179329226558,11,286408,2.99,856359.92,"Yes","Yes","No",0.15]
[1326,"2010-03-02",2.2861054072553046,15,124618,7.99,995697.82000000007,"No","Yes","No",0.15]
[1326,"2006-07-22",5.8973305954825461,19,52308,2.99,156400.92000000001,"No","Yes","No",0.2]
[1329,"2004-01-13",8.4188911704312108,25,270438,3.99,1079047.6200000001,"No","Yes","Yes",0.2]
[1330,"2006-03-04",6.2806297056810401,6,34355,7.99,274496.45,"No","Yes","No",0.09]
[1331,"2002-04-27",10.132785763175907,17,690169,9.99,6894788.3100000005,"No","Yes","Yes",0.2]
[1334,"2006-01-25",6.3846680355920604,19,490136,12.99,6366866.6399999997,"No","Yes","Yes",0.2]
[1340,"2009-07-27",2.8829568788501025,10,257087,7.99,2054125.1300000001,"No","Yes","No",0.09]
[1340,"2002-09-29",9.7084188911704317,7,623532,7.99,4982020.68,"No","Yes","Yes",0.2]
[1341,"2006-07-29",5.8781656399726216,20,540059,2.99,1614776.4100000001,"No","Yes","Yes",0.2]
[1342,"2000-02-19",12.317590691307323,18,74509,3.99,297290.91000000003,"No","Yes","No",0.2]
[1342,"2008-02-25",4.301163586584531,12,229728,2.99,686886.72000000009,"No","Yes","No",0.15]
[1344,"2006-08-16",5.8288843258042435,9,220720,3.99,880672.8,"No","Yes","No",0.09]
[1346,"2007-07-05",4.944558521560575,6,17314,10.99,190280.86000000002,"No","No","No",0.09]
[1348,"2010-07-17",1.9110198494182067,19,254150,3.99,1014058.5,"Yes","Yes","No",0.15]
[1351,"2011-04-30",1.1252566735112937,23,212408,3.99,847507.92,"Yes","Yes","No",0.15]
[1352,"2000-11-17",11.572895277207392,23,138970,2.99,415520.30000000005,"No","Yes","No",0.2]
[1355,"2009-05-26",3.052703627652293,6,479278,10.99,5267265.22,"No","No","No",0.09]
[1356,"2003-06-23",8.9774127310061598,23,273007,9.99,2727339.93,"No","Yes","Yes",0.2]
[1357,"2002-11-04",9.6098562628336754,1,78094,7.99,623971.06000000006,"No","Yes","No",0.09]
[1359,"2005-11-15",6.579055441478439,20,542953,9.99,5424100.4699999997,"No","Yes","Yes",0.2]
[1360,"2012-11-21",-0.43805612594113619,4,117093,12.99,1521038.07,"No","No","No",0.09]
[1361,"2011-03-19",1.2402464065708418,17,79360,2.99,237286.40000000002,"Yes","Yes","No",0.15]
[1364,"2007-07-02",4.9527720739219712,3,7423,10.99,81578.77,"No","No","No",0.09]
[1364,"2000-09-13",11.750855578370979,16,516313,2.99,1543775.87,"No","Yes","Yes",0.2]
[1366,"2004-03-06",8.2737850787132103,19,132118,12.99,1716212.82,"No","Yes","Yes",0.2]
[1370,"2003-03-26",9.2210814510609165,3,674022,5.99,4037391.7800000003,"No","Yes","Yes",0.2]
[1372,"2003-03-23",9.2292950034223136,10,479715,3.99,1914062.85,"No","Yes","Yes",0.2]
[1373,"2011-07-08",0.93634496919917864,1,618159,7.99,4939090.41,"No","No","No",0.09]
[1374,"2006-05-05",6.1108829568788501,23,482732,5.99,2891564.68,"No","Yes","Yes",0.2]
[1375,"2008-02-24",4.3039014373716631,24,328940,10.99,3615050.6,"No","Yes","No",0.15]
[1376,"2009-10-26",2.6338124572210813,12,233961,7.99,1869348.3900000001,"No","Yes","No",0.15]
[1376,"2000-05-23",12.060232717316905,3,592169,10.99,{"$f":"Number_of_Books_Sold*Sell_Price","v":6507937.3100000005},{"$f":"IF(AND(Years_Under_Contract<2,Number_of_Books_in_Print>4)=TRUE,\"Yes\",\"No\")","v":"No"},{"$f":"IF(OR(Years_Under_Contract>5,Number_of_Books_in_Print>=10)=TRUE,\"Yes\",\"No\")","v":"Yes"},{"$f":"IF(AND(Years_Under_Contract>5,OR(Number_of_Books_in_Print>350000,Income_Earned>=1000000))=TRUE,\"Yes\",\"No\")","v":"Yes"},{"$f":"IF(AND(Years_Under_Contract>5,OR(Number_of_Books_in_Print>10,Income_Earned>1000000)),0.2,IF(Number_of_Books_in_Print>10,0.15,0.09))","v":0.2}]
[1377,"2001-01-21",11.394934976043805,4,687237,9.99,6865497.6299999999,"No","Yes","Yes",0.2]
[1378,"2003-11-28",8.5448323066392877,6,434114,2.99,1298000.8600000001,"No","Yes","Yes",0.2]
[1382,"2006-05-07",6.1054072553045859,22,147289,2.99,440394.11000000004,"No","Yes","No",0.2]
[1382,"2005-09-06",6.7707049965776864,14,71012,2.99,212325.88,"No","Yes","No",0.2]
[1384,"2012-08-15",-0.16974674880219029,11,590216,12.99,7666905.8399999999,"Yes","Yes","No",0.15]
[1385,"2011-09-27",0.71457905544147848,20,374015,7.99,2988379.85,"Yes","Yes","No",0.15]
[1389,"2000-10-11",11.674195756331279,5,170907,3.99,681918.93,"No","Yes","No",0.09]
[1398,"2008-02-10",4.3422313483915129,3,646560,10.99,7105694.4000000004,"No","No","No",0.09]
[1399,"2007-11-07",4.602327173169062,9,118156,2.99,353286.44,"No","No","No",0.09]
[1400,"2003-05-01",9.122518822724162,17,626519,7.99,5005886.8100000005,"No","Yes","Yes",0.2]
[1405,"2000-11-17",11.572895277207392,1,546064,9.99,5455179.3600000003,"No","Yes","Yes",0.2]
[1406,"2007-03-15",5.2511978097193701,17,564671,10.99,6205734.29,"No","Yes","Yes",0.2]
[1407,"2003-10-11",8.6762491444216288,20,629100,2.99,1881009.0000000002,"No","Yes","Yes",0.2]
[1407,"2008-03-02",4.2847364818617386,17,616897,3.99,2461419.0300000003,"No","Yes","No",0.15]
[1408,"2006-05-26",6.0533880903490758,2,392854,2.99,1174633.4600000002,"No","Yes","Yes",0.2]
[1410,"2003-05-04",9.1143052703627649,8,155952,12.99,2025816.48,"No","Yes","Yes",0.2]
[1411,"2007-12-12",4.5065023956194388,22,73461,2.99,219648.39,"No","Yes","No",0.15]
[1413,"2005-02-23",7.3045859000684459,3,96742,3.99,386000.58,"No","Yes","No",0.09]
[1413,"2012-10-31",-0.3805612594113621,21,573764,2.99,1715554.36,"Yes","Yes","No",0.15]
[1416,"2012-08-21",-0.18617385352498289,19,596092,9.99,5954959.0800000001,"Yes","Yes","No",0.15]
[1418,"2012-08-25",-0.1971252566735113,13,65951,12.99,856703.49,"Yes","Yes","No",0.15]
[1420,"2000-02-26",12.2984257357974,13,71649,7.99,572475.51,"No","Yes","No",0.2]
[1421,"2004-11-06",7.6030116358658457,25,56564,5.99,338818.36,"No","Yes","No",0.2]
[1421,"2008-09-07",3.7672826830937716,7,211397,9.99,2111856.0300000003,"No","No","No",0.09]
[1421,"2004-09-26",7.7152635181382614,18,549683,2.99,1643552.1700000002,"No","Yes","Yes",0.2]
[1422,"2010-04-15",2.1656399726214923,22,325148,9.99,3248228.52,"No","Yes","No",0.15]
[1422,"2011-07-28",0.88158795345653662,13,25502,12.99,331270.98,"Yes","Yes","No",0.15]
[1423,"2007-08-07",4.8542094455852158,25,669390,2.99,2001476.1,"No","Yes","No",0.15]
[1424,"2011-01-22",1.3935660506502396,9,594362,15.99,9503848.3800000008,"Yes","No","No",0.09]
[1429,"2006-08-13",5.8370978781656397,22,402202,3.99,1604785.98,"No","Yes","Yes",0.2]
[1429,"2008-04-26",4.1341546885694731,3,478187,2.99,1429779.1300000001,"No","No","No",0.09]
[1430,"2003-05-20",9.0704996577686519,4,582092,9.99,5815099.0800000001,"No","Yes","Yes",0.2]
[1431,"2002-02-08",10.346338124572211,7,628504,3.99,2507730.96,"No","Yes","Yes",0.2]
[1432,"2011-06-06",1.0239561943874058,6,289167,3.99,1153776.33,"Yes","No","No",0.09]
[1434,"2003-11-24",8.555783709787816,24,540340,9.99,5397996.6000000006,"No","Yes","Yes",0.2]
[1440,"2010-09-05",1.7741273100616017,16,453627,9.99,4531733.7300000004,"Yes","Yes","No",0.15]
[1440,"2008-02-20",4.3148528405201914,4,425573,5.99,2549182.27,"No","No","No",0.09]
[1441,"2004-03-12",8.2573579739904179,15,435232,15.99,6959359.6799999997,"No","Yes","Yes",0.2]
[1442,"2010-11-16",1.5770020533880904,22,117265,9.99,1171477.3500000001,"Yes","Yes","No",0.15]
[1446,"2003-04-27",9.1334702258726903,5,296475,15.99,4740635.25,"No","Yes","Yes",0.2]
[1446,"2007-11-14",4.5831622176591376,20,573337,5.99,3434288.6300000004,"No","Yes","No",0.15]
[1447,"2010-03-03",2.2833675564681726,16,437311,10.99,4806047.8899999997,"No","Yes","No",0.15]
[1448,"2002-10-20",9.6509240246406574,24,370944,2.99,1109122.5600000001,"No","Yes","Yes",0.2]
[1457,"2004-07-10",7.9288158795345653,14,568422,2.99,1699581.78,"No","Yes","Yes",0.2]
[1457,"2005-03-12",7.2580424366872007,16,673783,9.99,6731092.1699999999,"No","Yes","Yes",0.2]
[1458,"2011-08-27",0.79945242984257359,16,408748,7.99,3265896.52,"Yes","Yes","No",0.15]
[1459,"2005-04-20",7.1512662559890483,9,286475,9.99,2861885.25,"No","Yes","Yes",0.2]
[1460,"2012-10-22",-0.35592060232717315,3,179640,2.99,537123.60000000009,"No","No","No",0.09]
[1461,"2001-05-26",11.052703627652292,16,169168,2.99,505812.32,"No","Yes","No",0.2]
[1461,"2007-12-28",4.4626967830253248,7,654115,9.99,6534608.8500000006,"No","No","No",0.09]
[1468,"2008-04-09",4.1806981519507183,7,429273,5.99,2571345.27,"No","No","No",0.09]
[1470,"2001-12-06",10.521560574948666,13,343399,7.99,2743758.0100000002,"No","Yes","Yes",0.2]
[1470,"2008-12-07",3.5181382614647503,5,459618,23.99,11026235.819999998,"No","No","No",0.09]
[1473,"2012-07-27",-0.11772758384668036,5,9510,9.99,95004.900000000009,"Yes","No","No",0.09]
[1474,"2011-11-18",0.57221081451060918,3,310052,10.99,3407471.48,"No","No","No",0.09]
[1476,"2004-05-04",8.1122518822724157,23,295901,12.99,3843753.99,"No","Yes","Yes",0.2]
[1478,"2001-03-23",11.227926078028748,15,264610,10.99,2908063.9,"No","Yes","Yes",0.2]
[1480,"2005-05-02",7.1184120465434635,19,548370,23.99,13155396.299999999,"No","Yes","Yes",0.2]
[1483,"2004-04-06",8.1889117043121153,25,247766,10.99,2722948.34,"No","Yes","Yes",0.2]
[1485,"2004-08-18",7.8220396988364138,9,414857,12.99,5388992.4299999997,"No","Yes","Yes",0.2]
[1485,"2008-09-18",3.7371663244353184,9,163765,5.99,980952.35000000009,"No","No","No",0.09]
[1491,"2003-10-09",8.6817248459958929,9,73321,9.99,732476.79,"No","Yes","No",0.09]
[1496,"2011-06-26",0.9691991786447639,7,474896,7.99,3794419.04,"Yes","No","No",0.09]
[1497,"2002-09-18",9.7385352498288835,3,675662,5.99,{"$f":"Number_of_Books_Sold*Sell_Price","v":4047215.3800000004},{"$f":"IF(AND(Years_Under_Contract<2,Number_of_Books_in_Print>4)=TRUE,\"Yes\",\"No\")","v":"No"},{"$f":"IF(OR(Years_Under_Contract>5,Number_of_Books_in_Print>=10)=TRUE,\"Yes\",\"No\")","v":"Yes"},{"$f":"IF(AND(Years_Under_Contract>5,OR(Number_of_Books_in_Print>350000,Income_Earned>=1000000))=TRUE,\"Yes\",\"No\")","v":"Yes"},{"$f":"IF(AND(Years_Under_Contract>5,OR(Number_of_Books_in_Print>10,Income_Earned>1000000)),0.2,IF(Number_of_Books_in_Print>10,0.15,0.09))","v":0.2}]
[1498,"2008-06-20",3.9835728952772076,6,367895,3.99,1467901.05,"No","No","No",0.09]
[1498,"2004-07-26",7.8850102669404514,10,536320,2.99,1603596.8,"No","Yes","Yes",0.2]
[1499,"2004-02-19",8.3175906913073234,12,502126,10.99,5518364.7400000002,"No","Yes","Yes",0.2]
[1502,"2000-03-30",12.208076659822039,16,576023,9.99,5754469.7700000005,"No","Yes","Yes",0.2]
[1502,"2011-10-31",0.62149212867898695,6,298760,2.99,893292.4,"Yes","No","No",0.09]
[1506,"2001-11-14",10.581793292265571,11,612369,2.99,1830983.31,"No","Yes","Yes",0.2]
[1506,"2012-04-08",0.1834360027378508,18,496634,3.99,1981569.6600000001,"Yes","Yes","No",0.15]
[1509,"2008-05-03",4.1149897330595486,23,471553,3.99,1881496.4700000002,"No","Yes","No",0.15]
[1512,"2003-08-30",8.7912388774811774,24,580033,3.99,2314331.67,"No","Yes","Yes",0.2]
[1514,"2004-08-01",7.868583162217659,22,436361,2.99,1304719.3900000001,"No","Yes","Yes",0.2]
[1515,"2009-09-13",2.751540041067762,9,563823,9.99,5632591.7700000005,"No","No","No",0.09]
[1516,"2007-03-28",5.2156057494866532,23,4811,15.99,76927.89,"No","Yes","No",0.2]
[1516,"2000-04-29",12.125941136208077,23,490245,12.99,6368282.5499999998,"No","Yes","Yes",0.2]
[1524,"2012-07-18",-9.3086926762491445E-2,4,81748,5.99,489670.52,"No","No","No",0.09]
[1527,"2001-02-03",11.359342915811089,24,554177,10.99,6090405.2300000004,"No","Yes","Yes",0.2]
[1530,"2001-11-29",10.540725530458589,3,487327,5.99,2919088.73,"No","Yes","Yes",0.2]
[1534,"2011-01-14",1.4154688569472964,19,385003,7.99,3076173.97,"Yes","Yes","No",0.15]
[1536,"2012-10-26",-0.36687200547570159,24,263404,5.99,1577789.96,"Yes","Yes","No",0.15]
[1537,"2012-12-03",-0.47091033538672145,8,613335,12.99,7967221.6500000004,"Yes","No","No",0.09]
[1538,"2011-09-08",0.76659822039698833,20,464095,23.99,11133639.049999999,"Yes","Yes","No",0.15]
[1548,"2008-03-23",4.2272416153319643,25,322223,3.99,1285669.77,"No","Yes","No",0.15]
[1553,"2005-02-20",7.312799452429843,13,22147,12.99,287689.53000000003,"No","Yes","No",0.2]
[1553,"2008-08-15",3.8302532511978096,16,602907,3.99,2405598.9300000002,"No","Yes","No",0.15]
[1558,"2010-01-10",2.4257357973990419,16,500507,2.99,1496515.9300000002,"No","Yes","No",0.15]
[1559,"2003-12-01",8.5366187542778924,20,656623,7.99,5246417.7700000005,"No","Yes","Yes",0.2]
[1559,"2004-02-18",8.3203285420944564,21,654254,3.99,2610473.46,"No","Yes","Yes",0.2]
[1559,"2001-07-19",10.904859685147159,10,19136,2.99,57216.640000000007,"No","Yes","No",0.09]
[1560,"2011-06-16",0.99657768651608492,10,89932,9.99,898420.68,"Yes","Yes","No",0.09]
[1562,"2002-05-09",10.099931553730322,11,297918,5.99,1784528.82,"No","Yes","Yes",0.2]
[1564,"2002-03-03",10.283367556468173,16,356109,3.99,1420874.9100000001,"No","Yes","Yes",0.2]
[1567,"2010-08-15",1.8316221765913758,11,606079,10.99,6660808.21,"Yes","Yes","No",0.15]
[1569,"2005-05-29",7.0444900752908968,3,62694,5.99,375537.06,"No","Yes","No",0.09]
[1570,"2005-03-04",7.2799452429842573,5,335341,2.99,1002669.5900000001,"No","Yes","Yes",0.2]
[1575,"2004-08-28",7.7946611909650922,4,81543,12.99,1059243.57,"No","Yes","Yes",0.2]
[1575,"2004-04-20",8.1505817932922664,14,388034,9.99,3876459.66,"No","Yes","Yes",0.2]
[1580,"2009-05-24",3.0581793292265571,12,154890,2.99,463121.10000000003,"No","Yes","No",0.15]
[1580,"2011-01-29",1.3744010951403149,3,315473,3.99,1258737.27,"No","No","No",0.09]
[1581,"2011-04-25",1.1389459274469542,21,584543,12.99,7593213.5700000003,"Yes","Yes","No",0.15]
[1581,"2005-05-27",7.0499657768651609,20,689632,7.99,5510159.6799999997,"No","Yes","Yes",0.2]
[1582,"2011-03-25",1.2238193018480492,8,96794,3.99,386208.06,"Yes","No","No",0.09]
[1587,"2006-09-30",5.7056810403832987,13,87939,2.99,262937.61000000004,"No","Yes","No",0.2]
[1589,"2004-01-11",8.424366872005475,20,375778,7.99,3002466.22,"No","Yes","Yes",0.2]
[1590,"2003-04-25",9.1389459274469544,22,389807,5.99,2334943.9300000002,"No","Yes","Yes",0.2]
[1593,"2007-07-31",4.8733744010951403,9,252587,5.99,1512996.1300000001,"No","No","No",0.09]
[1601,"2007-08-02",4.8678986995208762,7,231948,9.99,2317160.52,"No","No","No",0.09]
[1601,"2007-03-03",5.2840520191649558,6,344839,2.99,1031068.6100000001,"No","Yes","Yes",0.2]
[1601,"2002-11-22",9.5605749486652982,17,50037,12.99,649980.63,"No","Yes","No",0.2]
[1602,"2005-12-17",6.491444216290212,22,291598,2.99,871878.02,"No","Yes","No",0.2]
[1602,"2010-03-04",2.2806297056810405,1,184550,5.99,1105454.5,"No","No","No",0.09]
[1605,"2001-01-20",11.397672826830938,24,581050,2.99,1737339.5000000002,"No","Yes","Yes",0.2]
[1607,"2008-08-03",3.8631074606433948,1,465408,9.99,4649425.92,"No","No","No",0.09]
[1611,"2002-07-06",9.9411362080766601,22,654772,23.99,15707980.279999999,"No","Yes","Yes",0.2]
[1611,"2006-10-14",5.6673511293634498,21,311711,23.99,7477946.8899999997,"No","Yes","Yes",0.2]
[1613,"2008-05-15",4.0821355236139629,23,386193,10.99,4244261.07,"No","Yes","No",0.15]
[1614,"2001-03-06",11.274469541409994,20,109297,5.99,654689.03,"No","Yes","No",0.2]
[1614,"2012-01-14",0.41615331964407942,15,508137,5.99,3043740.63,"Yes","Yes","No",0.15]
[1616,"2011-05-24",1.0595482546201231,3,356759,2.99,1066709.4100000001,"No","No","No",0.09]
[1617,"2004-03-12",8.2573579739904179,15,277421,7.99,2216593.79,"No","Yes","Yes",0.2]
[1624,"2010-02-04",2.3572895277207393,5,13045,9.99,130319.55,"No","No","No",0.09]
[1625,"2011-08-25",0.80492813141683783,5,213385,3.99,851406.15,"Yes","No","No",0.09]
[1628,"2007-01-10",5.4264202600958251,12,519465,23.99,12461965.35,"No","Yes","Yes",0.2]
[1629,"2001-12-26",10.466803559206022,5,153868,5.99,921669.32000000007,"No","Yes","No",0.09]
[1629,"2008-07-17",3.9096509240246409,2,396133,5.99,2372836.67,"No","No","No",0.09]
[1630,"2006-11-03",5.6125941136208075,13,305932,10.99,{"$f":"Number_of_Books_Sold*Sell_Price","v":3362192.68},{"$f":"IF(AND(Years_Under_Contract<2,Number_of_Books_in_Print>4)=TRUE,\"Yes\",\"No\")","v":"No"},{"$f":"IF(OR(Years_Under_Contract>5,Number_of_Books_in_Print>=10)=TRUE,\"Yes\",\"No\")","v":"Yes"},{"$f":"IF(AND(Years_Under_Contract>5,OR(Number_of_Books_in_Print>350000,Income_Earned>=1000000))=TRUE,\"Yes\",\"No\")","v":"Yes"},{"$f":"IF(AND(Years_Under_Contract>5,OR(Number_of_Books_in_Print>10,Income_Earned>1000000)),0.2,IF(Number_of_Books_in_Print>10,0.15,0.09))","v":0.2}]
[1631,"2011-08-26",0.80219028062970565,3,52009,10.99,571578.91,"No","No","No",0.09]
[1632,"2004-08-01",7.868583162217659,12,56968,23.99,1366662.3199999998,"No","Yes","Yes",0.2]
[1634,"2005-04-25",7.137577002053388,7,520435,10.99,5719580.6500000004,"No","Yes","Yes",0.2]
[1635,"2005-09-05",6.7734428473648185,3,70651,2.99,211246.49000000002,"No","Yes","No",0.09]
[1638,"2008-11-14",3.5811088295687883,23,192112,10.99,2111310.88,"No","Yes","No",0.15]
[1640,"2001-09-03",10.778918548939084,13,225082,5.99,1348241.18,"No","Yes","Yes",0.2]
[1642,"2010-11-11",1.5906913073237507,20,588541,23.99,14119098.59,"Yes","Yes","No",0.15]
[1643,"2010-03-30",2.2094455852156059,22,12746,2.99,38110.54,"No","Yes","No",0.15]
[1644,"2003-02-02",9.3634496919917858,23,161540,10.99,1775324.6,"No","Yes","Yes",0.2]
[1647,"2007-08-17",4.8268309377138943,8,685143,9.99,6844578.5700000003,"No","No","No",0.09]
[1647,"2006-12-11",5.508555783709788,21,568990,2.99,1701280.1,"No","Yes","Yes",0.2]
[1650,"2001-02-17",11.321013004791238,7,119865,3.99,478261.35000000003,"No","Yes","No",0.09]
[1651,"2009-08-06",2.8555783709787819,16,60220,2.99,180057.80000000002,"No","Yes","No",0.15]
[1653,"2001-10-28",10.628336755646817,1,212133,2.99,634277.67000000004,"No","Yes","No",0.09]
[1655,"2012-07-05",-5.7494866529774126E-2,12,491475,23.99,11790485.25,"Yes","Yes","No",0.15]
[1655,"2012-10-05",-0.30937713894592744,25,689608,15.99,11026831.92,"Yes","Yes","No",0.15]
[1656,"2006-11-14",5.5824777549623548,11,307990,2.99,920890.10000000009,"No","Yes","No",0.2]
[1656,"2012-12-31",-0.54757015742642023,23,237523,23.99,5698176.7699999996,"Yes","Yes","No",0.15]
[1657,"2004-10-10",7.6769336071184124,8,533303,5.99,3194484.97,"No","Yes","Yes",0.2]
[1661,"2009-09-12",2.754277891854894,16,75840,12.99,985161.6,"No","Yes","No",0.15]
[1662,"2011-09-13",0.75290896646132788,21,688791,2.99,2059485.09,"Yes","Yes","No",0.15]
[1666,"2007-11-06",4.6050650239561941,10,177902,5.99,1065632.98,"No","Yes","No",0.09]
[1668,"2012-07-04",-5.4757015742642023E-2,18,404050,10.99,4440509.5,"Yes","Yes","No",0.15]
[1669,"2007-03-26",5.2210814510609174,10,369351,9.99,3689816.49,"No","Yes","Yes",0.2]
[1670,"2012-07-10",-7.1184120465434639E-2,23,494160,9.99,4936658.4000000004,"Yes","Yes","No",0.15]
[1670,"2005-05-19",7.0718685831622174,11,166284,12.99,2160029.16,"No","Yes","Yes",0.2]
[1670,"2005-10-25",6.6365503080082133,9,380056,9.99,3796759.44,"No","Yes","Yes",0.2]
[1670,"2006-03-06",6.2751540041067759,2,170002,3.99,678307.98,"No","Yes","No",0.09]
[1671,"2002-07-25",9.8891170431211499,20,269863,10.99,2965794.37,"No","Yes","Yes",0.2]
[1671,"2011-04-04",1.1964407939767283,20,526281,5.99,3152423.19,"Yes","Yes","No",0.15]
[1677,"2007-01-04",5.4428473648186175,7,247380,12.99,3213466.2,"No","Yes","Yes",0.2]
[1678,"2002-06-24",9.9739904175222449,15,276875,7.99,2212231.25,"No","Yes","Yes",0.2]
[1680,"2011-10-15",0.6652977412731006,24,662806,12.99,8609849.9399999995,"Yes","Yes","No",0.15]
[1680,"2001-07-01",10.954140999315538,8,38152,2.99,114074.48000000001,"No","Yes","No",0.09]
[1680,"2002-05-01",10.121834360027378,4,183696,2.99,549251.04,"No","Yes","No",0.09]
[1681,"2010-10-08",1.6837782340862424,15,149008,2.99,445533.92000000004,"Yes","Yes","No",0.15]
[1685,"2002-08-25",9.8042436687200549,7,414282,2.99,1238703.1800000002,"No","Yes","Yes",0.2]
[1688,"2009-06-11",3.0088980150581794,3,500361,2.99,1496079.3900000001,"No","No","No",0.09]
[1689,"2012-12-08",-0.48459958932238195,2,197094,5.99,1180593.06,"No","No","No",0.09]
[1690,"2007-02-23",5.3059548254620124,11,29000,3.99,115710,"No","Yes","No",0.2]
[1695,"2002-03-11",10.261464750171116,25,190319,2.99,569053.81000000006,"No","Yes","No",0.2]
[1695,"2000-12-18",11.488021902806297,13,698535,2.99,2088619.6500000001,"No","Yes","Yes",0.2]
[1695,"2001-07-12",10.924024640657084,13,314083,9.99,3137689.17,"No","Yes","Yes",0.2]
[1700,"2000-07-11",11.926078028747433,24,278495,2.99,832700.05,"No","Yes","No",0.2]
[1700,"2001-01-07",11.433264887063656,12,62389,12.99,810433.11,"No","Yes","No",0.2]
[1702,"2010-07-28",1.8809034907597535,12,259575,5.99,1554854.25,"Yes","Yes","No",0.15]
[1702,"2002-11-23",9.5578370978781653,18,678891,9.99,6782121.0899999999,"No","Yes","Yes",0.2]
[1704,"2006-06-14",6.0013689253935665,13,211092,12.99,2742085.08,"No","Yes","Yes",0.2]
[1706,"2011-02-18",1.3196440793976729,11,267016,7.99,2133457.84,"Yes","Yes","No",0.15]
[1708,"2004-12-07",7.5181382614647498,22,419561,10.99,4610975.3899999997,"No","Yes","Yes",0.2]
[1712,"2009-02-13",3.3319644079397674,18,468339,2.99,1400333.61,"No","Yes","No",0.15]
[1713,"2009-05-19",3.0718685831622174,5,607825,15.99,9719121.75,"No","No","No",0.09]
[1716,"2007-09-19",4.7364818617385351,5,691467,2.99,2067486.33,"No","No","No",0.09]
[1716,"2002-10-13",9.6700889801505809,9,578108,2.99,1728542.9200000002,"No","Yes","Yes",0.2]
[1717,"2003-07-02",8.9527720739219721,18,663070,10.99,7287139.2999999998,"No","Yes","Yes",0.2]
[1718,"2008-09-17",3.7399041752224504,8,166310,10.99,1827746.9000000001,"No","No","No",0.09]
[1718,"2011-11-06",0.60506502395619444,13,378745,2.99,1132447.55,"Yes","Yes","No",0.15]
[1719,"2006-05-15",6.0835044490075294,22,30237,7.99,241593.63,"No","Yes","No",0.2]
[1719,"2002-07-21",9.9000684462696782,18,316946,10.99,3483236.54,"No","Yes","Yes",0.2]
[1719,"2011-03-19",1.2402464065708418,21,667965,10.99,7340935.3500000006,"Yes","Yes","No",0.15]
[1722,"2011-02-05",1.3552361396303902,14,593410,23.99,14235905.899999999,"Yes","Yes","No",0.15]
[1723,"2004-10-01",7.7015742642026011,4,188722,10.99,2074054.78,"No","Yes","Yes",0.2]
[1724,"2008-03-21",4.2327173169062284,25,567133,3.99,2262860.67,"No","Yes","No",0.15]
[1724,"2002-12-16",9.4948665297741268,14,652466,2.99,{"$f":"Number_of_Books_Sold*Sell_Price","v":1950873.34},{"$f":"IF(AND(Years_Under_Contract<2,Number_of_Books_in_Print>4)=TRUE,\"Yes\",\"No\")","v":"No"},{"$f":"IF(OR(Years_Under_Contract>5,Number_of_Books_in_Print>=10)=TRUE,\"Yes\",\"No\")","v":"Yes"},{"$f":"IF(AND(Years_Under_Contract>5,OR(Number_of_Books_in_Print>350000,Income_Earned>=1000000))=TRUE,\"Yes\",\"No\")","v":"Yes"},{"$f":"IF(AND(Years_Under_Contract>5,OR(Number_of_Books_in_Print>10,Income_Earned>1000000)),0.2,IF(Number_of_Books_in_Print>10,0.15,0.09))","v":0.2}]
[1725,"2000-03-30",12.208076659822039,8,280576,2.99,838922.24000000011,"No","Yes","No",0.09]
[1728,"2002-08-22",9.8124572210814502,10,220721,3.99,880676.79,"No","Yes","No",0.09]
[1729,"2007-02-05",5.3552361396303905,16,181597,9.99,1814154.03,"No","Yes","Yes",0.2]
[1732,"2007-11-24",4.5557837097878169,10,190116,2.99,568446.84000000008,"No","Yes","No",0.09]
[1732,"2004-10-06",7.6878850102669407,23,113964,7.99,910572.36,"No","Yes","No",0.2]
[1734,"2009-01-08",3.4305270362765228,25,473761,9.99,4732872.3899999997,"No","Yes","No",0.15]
[1734,"2003-10-26",8.6351813826146469,9,536932,23.99,12880998.68,"No","Yes","Yes",0.2]
[1736,"2002-06-13",10.004106776180699,22,441139,2.99,1319005.6100000001,"No","Yes","Yes",0.2]
[1737,"2006-03-10",6.2642026009582477,14,634098,9.99,6334639.0200000005,"No","Yes","Yes",0.2]
[1739,"2005-04-26",7.1348391512662559,23,178110,2.99,532548.9,"No","Yes","No",0.2]
[1741,"2009-09-16",2.7433264887063653,1,497154,5.99,2977952.46,"No","No","No",0.09]
[1745,"2001-08-26",10.80082135523614,17,39393,12.99,511715.07,"No","Yes","No",0.2]
[1745,"2012-10-12",-0.32854209445585214,2,71287,7.99,569583.13,"No","No","No",0.09]
[1749,"2008-03-06",4.2737850787132103,8,221622,7.99,1770759.78,"No","No","No",0.09]
[1750,"2002-10-01",9.7029431895961675,3,290770,15.99,4649412.3,"No","Yes","Yes",0.2]
[1752,"2009-05-13",3.0882956878850103,12,628606,10.99,6908379.9400000004,"No","Yes","No",0.15]
[1754,"2001-11-09",10.595482546201232,4,513827,3.99,2050169.7300000002,"No","Yes","Yes",0.2]
[1754,"2011-05-23",1.0622861054072552,25,286142,12.99,3716984.58,"Yes","Yes","No",0.15]
[1755,"2000-01-01",12.451745379876797,14,520554,12.99,6761996.46,"No","Yes","Yes",0.2]
[1755,"2008-03-11",4.26009582477755,25,86360,10.99,949096.4,"No","Yes","No",0.15]
[1756,"2007-05-05",5.1115674195756329,20,566304,2.99,1693248.9600000002,"No","Yes","Yes",0.2]
[1758,"2007-01-07",5.4346338124572213,19,167007,3.99,666357.93000000005,"No","Yes","No",0.2]
[1758,"2003-05-12",9.0924024640657084,19,456320,5.99,2733356.8000000003,"No","Yes","Yes",0.2]
[1758,"2010-10-16",1.6618754277891854,11,301915,15.99,4827620.8499999996,"Yes","Yes","No",0.15]
[1760,"2011-03-11",1.2621492128678986,10,161058,15.99,2575317.42,"Yes","Yes","No",0.09]
[1760,"2010-11-14",1.5824777549623545,15,605598,9.99,6049924.0200000005,"Yes","Yes","No",0.15]
[1762,"2011-12-05",0.52566735112936347,14,290277,2.99,867928.2300000001,"Yes","Yes","No",0.15]
[1762,"2009-05-18",3.07460643394935,20,629645,2.99,1882638.55,"No","Yes","No",0.15]
[1762,"2003-12-17",8.4928131416837775,1,686856,12.99,8922259.4399999995,"No","Yes","Yes",0.2]
[1767,"2012-10-15",-0.33675564681724846,16,232212,9.99,2319797.88,"Yes","Yes","No",0.15]
[1767,"2004-07-29",7.8767967145790552,12,233115,2.99,697013.85000000009,"No","Yes","No",0.2]
[1770,"2012-11-01",-0.38329911019849416,22,696491,3.99,2778999.0900000003,"Yes","Yes","No",0.15]
[1772,"2012-03-12",0.25735797399041754,11,242428,2.99,724859.72000000009,"Yes","Yes","No",0.15]
[1777,"2001-06-13",11.003422313483915,8,530736,3.99,2117636.64,"No","Yes","Yes",0.2]
[1780,"2001-10-24",10.639288158795345,8,53369,23.99,1280322.3099999998,"No","Yes","Yes",0.2]
[1781,"2007-06-13",5.0047912388774813,6,660572,7.99,5277970.28,"No","Yes","Yes",0.2]
[1782,"2003-10-15",8.6652977412731005,13,446958,5.99,2677278.42,"No","Yes","Yes",0.2]
[1783,"2012-12-01",-0.4654346338124572,17,109718,3.99,437774.82,"Yes","Yes","No",0.15]
[1784,"2004-07-02",7.9507186858316219,18,398681,3.99,1590737.1900000002,"No","Yes","Yes",0.2]
[1785,"2009-09-20",2.732375085557837,22,351067,2.99,1049690.33,"No","Yes","No",0.15]
[1785,"2000-04-09",12.180698151950718,16,164084,7.99,1311031.1600000001,"No","Yes","Yes",0.2]
[1785,"2008-12-23",3.4743326488706368,8,174038,23.99,4175171.6199999996,"No","No","No",0.09]
[1786,"2006-01-02",6.4476386036960989,3,664285,5.99,3979067.1500000004,"No","Yes","Yes",0.2]
[1786,"2008-06-22",3.978097193702943,3,237709,7.99,1899294.9100000001,"No","No","No",0.09]
[1788,"2012-01-21",0.39698836413415467,2,181758,23.99,4360374.42,"No","No","No",0.09]
[1789,"2012-10-15",-0.33675564681724846,7,184552,12.99,2397330.48,"Yes","No","No",0.09]
[1789,"2002-05-02",10.119096509240247,2,513886,2.99,1536519.1400000001,"No","Yes","Yes",0.2]
[1795,"2004-04-24",8.1396303901437363,19,256220,12.99,3328297.8000000003,"No","Yes","Yes",0.2]
[1801,"2009-09-25",2.7186858316221767,9,267900,12.99,3480021,"No","No","No",0.09]
[1805,"2003-11-04",8.6105407255304591,6,355408,9.99,3550525.92,"No","Yes","Yes",0.2]
[1807,"2008-01-29",4.3750855578370977,15,345572,5.99,2069976.28,"No","Yes","No",0.15]
[1807,"2003-03-16",9.2484599589322389,17,654181,10.99,7189449.1900000004,"No","Yes","Yes",0.2]
[1809,"2008-12-26",3.4661190965092401,12,541748,3.99,2161574.52,"No","Yes","No",0.15]
[1810,"2002-09-06",9.7713894592744701,3,3597,9.99,35934.03,"No","Yes","No",0.09]
[1810,"2012-07-16",-8.761122518822724E-2,1,691662,2.99,2068069.3800000001,"No","No","No",0.09]
[1812,"2009-03-25",3.2224503764544834,17,130159,10.99,1430447.41,"No","Yes","No",0.15]
[1813,"2003-12-06",8.5229295003422312,3,660404,2.99,1974607.9600000002,"No","Yes","Yes",0.2]
[1814,"2000-05-07",12.10403832991102,10,443127,2.99,1324949.73,"No","Yes","Yes",0.2]
[1815,"2000-06-12",12.005475701574264,23,509812,10.99,5602833.8799999999,"No","Yes","Yes",0.2]
[1817,"2011-08-25",0.80492813141683783,22,301332,12.99,3914302.68,"Yes","Yes","No",0.15]
[1818,"2001-02-06",11.351129363449692,16,161215,2.99,482032.85000000003,"No","Yes","No",0.2]
[1820,"2004-12-13",7.5017111567419574,19,378081,7.99,3020867.19,"No","Yes","Yes",0.2]
[1820,"2010-04-04",2.1957563312799451,4,35292,9.99,352567.08,"No","No","No",0.09]
[1823,"2006-02-17",6.321697467488022,24,56163,7.99,{"$f":"Number_of_Books_Sold*Sell_Price","v":448742.37},{"$f":"IF(AND(Years_Under_Contract<2,Number_of_Books_in_Print>4)=TRUE,\"Yes\",\"No\")","v":"No"},{"$f":"IF(OR(Years_Under_Contract>5,Number_of_Books_in_Print>=10)=TRUE,\"Yes\",\"No\")","v":"Yes"},{"$f":"IF(AND(Years_Under_Contract>5,OR(Number_of_Books_in_Print>350000,Income_Earned>=1000000))=TRUE,\"Yes\",\"No\")","v":"No"},{"$f":"IF(AND(Years_Under_Contract>5,OR(Number_of_Books_in_Print>10,Income_Earned>1000000)),0.2,IF(Number_of_Books_in_Print>10,0.15,0.09))","v":0.2}]
[1825,"2010-03-14",2.2532511978097194,8,310717,23.99,7454100.8299999991,"No","No","No",0.09]
[1826,"2009-06-13",3.0034223134839153,12,377070,7.99,3012789.3000000003,"No","Yes","No",0.15]
[1828,"2009-06-28",2.9623545516769334,3,367829,12.99,4778098.71,"No","No","No",0.09]
[1830,"2010-12-12",1.5058179329226558,25,344912,10.99,3790582.88,"Yes","Yes","No",0.15]
[1833,"2006-10-29",5.6262833675564679,20,361367,9.99,3610056.33,"No","Yes","Yes",0.2]
[1833,"2003-07-09",8.9336071184120467,3,476122,10.99,5232580.78,"No","Yes","Yes",0.2]
[1833,"2010-09-09",1.7631759069130732,10,623763,23.99,14964074.369999999,"Yes","Yes","No",0.09]
[1833,"2003-09-25",8.7200547570157418,9,326813,7.99,2611235.87,"No","Yes","Yes",0.2]
[1835,"2001-09-02",10.781656399726215,5,454576,9.99,4541214.24,"No","Yes","Yes",0.2]
[1836,"2005-04-17",7.1594798083504445,15,592577,23.99,14215922.229999999,"No","Yes","Yes",0.2]
[1838,"2009-01-04",3.4414784394250515,10,516395,12.99,6707971.0499999998,"No","Yes","No",0.09]
[1842,"2008-08-06",3.8548939082819986,4,477411,2.99,1427458.8900000001,"No","No","No",0.09]
[1843,"2006-08-23",5.8097193702943191,18,125419,7.99,1002097.81,"No","Yes","Yes",0.2]
[1844,"2012-09-22",-0.27378507871321012,6,380654,23.99,9131889.459999999,"Yes","No","No",0.09]
[1845,"2006-10-09",5.6810403832991101,7,293925,10.99,3230235.75,"No","Yes","Yes",0.2]
[1847,"2007-07-19",4.9062286105407251,9,19529,5.99,116978.71,"No","No","No",0.09]
[1848,"2010-12-30",1.4565366187542779,11,248781,5.99,1490198.19,"Yes","Yes","No",0.15]
[1849,"2001-03-15",11.249828884325805,22,216033,10.99,2374202.67,"No","Yes","Yes",0.2]
[1850,"2002-09-20",9.7330595482546194,25,421824,2.99,1261253.76,"No","Yes","Yes",0.2]
[1857,"2005-04-03",7.1978097193702943,10,119425,2.99,357080.75,"No","Yes","No",0.09]
[1859,"2007-09-23",4.7255304585900069,22,302900,2.99,905671.00000000012,"No","Yes","No",0.15]
[1861,"2000-12-15",11.496235455167694,23,18160,5.99,108778.40000000001,"No","Yes","No",0.2]
[1862,"2000-07-24",11.890485968514716,14,690233,5.99,4134495.67,"No","Yes","Yes",0.2]
[1864,"2006-06-29",5.9603011635865846,25,277431,12.99,3603828.69,"No","Yes","Yes",0.2]
[1865,"2010-11-07",1.6016427104722792,14,600881,9.99,6002801.1900000004,"Yes","Yes","No",0.15]
[1865,"2003-05-14",9.0869267624914443,9,63600,2.99,190164,"No","Yes","No",0.09]
[1865,"2009-02-03",3.3593429158110881,4,372598,12.99,4840048.0200000005,"No","No","No",0.09]
[1870,"2007-12-22",4.4791238877481181,18,491880,12.99,6389521.2000000002,"No","Yes","No",0.15]
[1871,"2007-10-30",4.6242299794661195,24,648493,5.99,3884473.0700000003,"No","Yes","No",0.15]
[1871,"2009-05-15",3.0828199863107462,7,349196,3.99,1393292.04,"No","No","No",0.09]
[1873,"2002-06-24",9.9739904175222449,15,134651,3.99,537257.49,"No","Yes","No",0.2]
[1877,"2000-01-06",12.438056125941136,18,451013,2.99,1348528.87,"No","Yes","Yes",0.2]
[1879,"2006-08-06",5.8562628336755651,8,185515,9.99,1853294.85,"No","Yes","Yes",0.2]
[1880,"2006-12-01",5.5359342915811087,1,205198,9.99,2049928.02,"No","Yes","Yes",0.2]
[1884,"2006-06-12",6.0068446269678306,15,142406,5.99,853011.94000000006,"No","Yes","No",0.2]
[1885,"2002-07-22",9.897330595482547,11,290161,10.99,3188869.39,"No","Yes","Yes",0.2]
[1885,"2002-01-11",10.422997946611909,5,135156,2.99,404116.44,"No","Yes","No",0.09]
[1886,"2008-10-24",3.6386036960985626,10,272017,9.99,2717449.83,"No","Yes","No",0.09]
[1886,"2006-12-24",5.4729637234770703,12,426990,3.99,1703690.1,"No","Yes","Yes",0.2]
[1889,"2006-04-15",6.1656399726214923,4,534539,12.99,6943661.6100000003,"No","Yes","Yes",0.2]
[1889,"2005-01-16",7.4086242299794662,22,146216,15.99,2337993.84,"No","Yes","Yes",0.2]
[1891,"2006-11-21",5.5633127994524294,5,583716,2.99,1745310.84,"No","Yes","Yes",0.2]
[1892,"2005-02-06",7.3511293634496919,15,452790,12.99,5881742.1000000006,"No","Yes","Yes",0.2]
[1894,"2001-10-23",10.642026009582478,12,675050,23.99,16194449.499999998,"No","Yes","Yes",0.2]
[1894,"2011-05-02",1.1197809719370295,4,513681,2.99,1535906.1900000002,"No","No","No",0.09]
[1896,"2000-09-10",11.759069130732374,12,612015,2.99,1829924.85,"No","Yes","Yes",0.2]
[1898,"2003-06-14",9.0020533880903493,22,321008,2.99,959813.92,"No","Yes","No",0.2]
[1899,"2006-08-16",5.8288843258042435,21,383854,2.99,1147723.4600000002,"No","Yes","Yes",0.2]
[1903,"2001-03-13",11.255304585900069,3,677022,5.99,4055361.7800000003,"No","Yes","Yes",0.2]
[1912,"2000-02-21",12.312114989733059,25,448983,7.99,3587374.17,"No","Yes","Yes",0.2]
[1914,"2006-09-19",5.7357973990417523,17,137228,10.99,1508135.72,"No","Yes","Yes",0.2]
[1914,"2001-10-13",10.669404517453799,22,285382,5.99,1709438.1800000002,"No","Yes","Yes",0.2]
[1920,"2005-07-25",6.8884325804243671,1,374118,5.99,2240966.8200000003,"No","Yes","Yes",0.2]
[1925,"2010-12-30",1.4565366187542779,17,529286,7.99,4228995.1399999997,"Yes","Yes","No",0.15]
[1932,"2011-10-11",0.67624914442162898,3,157165,2.99,469923.35000000003,"No","No","No",0.09]
[1934,"2010-02-06",2.3518138261464752,19,495276,12.99,6433635.2400000002,"No","Yes","No",0.15]
[1937,"2000-10-18",11.655030800821356,19,564234,12.99,7329399.6600000001,"No","Yes","Yes",0.2]
[1941,"2001-08-26",10.80082135523614,16,174666,12.99,2268911.34,"No","Yes","Yes",0.2]
[1942,"2008-12-09",3.5126625598904861,24,510787,2.99,1527253.1300000001,"No","Yes","No",0.15]
[1946,"2000-12-16",11.493497604380561,25,629621,2.99,1882566.79,"No","Yes","Yes",0.2]
[1947,"2010-11-28",1.5441478439425051,22,278127,23.99,6672266.7299999995,"Yes","Yes","No",0.15]
[1952,"2005-09-13",6.751540041067762,16,174059,10.99,1912908.4100000001,"No","Yes","Yes",0.2]
[1952,"2008-04-05",4.1916495550992474,15,142084,2.99,424831.16000000003,"No","Yes","No",0.15]
[1957,"2012-04-09",0.1806981519507187,11,573025,9.99,{"$f":"Number_of_Books_Sold*Sell_Price","v":5724519.75},{"$f":"IF(AND(Years_Under_Contract<2,Number_of_Books_in_Print>4)=TRUE,\"Yes\",\"No\")","v":"Yes"},{"$f":"IF(OR(Years_Under_Contract>5,Number_of_Books_in_Print>=10)=TRUE,\"Yes\",\"No\")","v":"Yes"},{"$f":"IF(AND(Years_Under_Contract>5,OR(Number_of_Books_in_Print>350000,Income_Earned>=1000000))=TRUE,\"Yes\",\"No\")","v":"No"},{"$f":"IF(AND(Years_Under_Contract>5,OR(Number_of_Books_in_Print>10,Income_Earned>1000000)),0.2,IF(Number_of_Books_in_Print>10,0.15,0.09))","v":0.15}]
[1957,"2001-03-02",11.285420944558522,13,569510,15.99,9106464.9000000004,"No","Yes","Yes",0.2]
[1957,"2010-08-22",1.8124572210814511,14,562672,10.99,6183765.2800000003,"Yes","Yes","No",0.15]
[1957,"2008-06-11",4.0082135523613962,16,102555,5.99,614304.45000000007,"No","Yes","No",0.15]
[1958,"2002-08-02",9.8672142368240934,1,213839,2.99,639378.6100000001,"No","Yes","No",0.09]
[1959,"2006-04-07",6.1875427789185489,16,446606,2.99,1335351.9400000002,"No","Yes","Yes",0.2]
[1960,"2002-07-10",9.9301848049281318,23,570456,12.99,7410223.4400000004,"No","Yes","Yes",0.2]
[1960,"2006-05-01",6.1218343600273784,18,191232,5.99,1145479.6799999999,"No","Yes","Yes",0.2]
[1961,"2004-05-26",8.0520191649555102,4,39718,3.99,158474.82,"No","Yes","No",0.09]
[1963,"2006-11-06",5.6043805612594113,9,630360,5.99,3775856.4,"No","Yes","Yes",0.2]
[1964,"2011-09-18",0.73921971252566732,17,614149,10.99,6749497.5099999998,"Yes","Yes","No",0.15]
[1964,"2000-01-17",12.407939767282683,21,106919,2.99,319687.81,"No","Yes","No",0.2]
[1966,"2005-08-13",6.8364134154688569,14,7770,7.99,62082.3,"No","Yes","No",0.2]
[1971,"2010-12-15",1.4976043805612593,3,492310,2.99,1472006.9000000001,"No","No","No",0.09]
[1972,"2001-08-30",10.789869952087612,7,554468,5.99,3321263.3200000003,"No","Yes","Yes",0.2]
[1974,"2009-05-20",3.0691307323750854,5,136299,15.99,2179421.0100000002,"No","No","No",0.09]
[1974,"2009-01-26",3.3812457221081451,10,448559,2.99,1341191.4100000001,"No","Yes","No",0.09]
[1975,"2010-12-02",1.5331964407939767,18,594713,10.99,6535895.8700000001,"Yes","Yes","No",0.15]
[1976,"2009-03-27",3.2169746748802188,17,119386,9.99,1192666.1400000001,"No","Yes","No",0.15]
[1977,"2002-03-03",10.283367556468173,7,407359,2.99,1218003.4100000001,"No","Yes","Yes",0.2]
[1978,"2001-03-25",11.222450376454484,8,152203,23.99,3651349.9699999997,"No","Yes","Yes",0.2]
[1980,"2002-12-07",9.5195071868583163,22,90849,3.99,362487.51,"No","Yes","No",0.2]
[1981,"2010-08-20",1.8179329226557153,22,588335,12.99,7642471.6500000004,"Yes","Yes","No",0.15]
[1981,"2010-09-03",1.7796030116358659,8,512623,5.99,3070611.77,"Yes","No","No",0.09]
[1981,"2010-12-12",1.5058179329226558,7,74034,12.99,961701.66,"Yes","No","No",0.09]
[1982,"2007-11-03",4.6132785763175903,20,577796,2.99,1727610.04,"No","Yes","No",0.15]
[1989,"2012-06-12",5.4757015742642025E-3,22,118435,2.99,354120.65,"Yes","Yes","No",0.15]
[1991,"2010-04-27",2.1327857631759071,21,148058,5.99,886867.42,"No","Yes","No",0.15]
[1992,"2003-02-15",9.3278576317590698,8,251528,7.99,2009708.72,"No","Yes","Yes",0.2]
[1996,"2005-03-06",7.2744695414099931,9,81391,2.99,243359.09000000003,"No","Yes","No",0.09]
[1997,"2004-04-23",8.1423682409308693,19,327938,9.99,3276100.62,"No","Yes","Yes",0.2]
[1999,"2010-04-29",2.1273100616016429,16,640032,2.99,1913695.6800000002,"No","Yes","No",0.15]
[1999,"2011-03-19",1.2402464065708418,20,73099,9.99,730259.01,"Yes","Yes","No",0.15]
[2001,"2004-07-13",7.9206023271731691,15,655624,10.99,7205307.7599999998,"No","Yes","Yes",0.2]
[2002,"2010-01-05",2.4394250513347022,9,228185,2.99,682273.15,"No","No","No",0.09]
[2004,"2011-09-03",0.78028747433264889,11,133418,2.99,398919.82,"Yes","Yes","No",0.15]
[2004,"2008-10-01",3.7015742642026011,25,250115,7.99,1998418.85,"No","Yes","No",0.15]
[2008,"2006-07-14",5.9192334017796027,8,182249,12.99,2367414.5100000002,"No","Yes","Yes",0.2]
[2009,"2006-06-09",6.0150581793292268,10,339998,2.99,1016594.02,"No","Yes","Yes",0.2]
[2009,"2012-10-22",-0.35592060232717315,16,43995,7.99,351520.05,"Yes","Yes","No",0.15]
[2011,"2005-08-18",6.8227241615331966,24,617692,15.99,9876895.0800000001,"No","Yes","Yes",0.2]
[2015,"2008-08-03",3.8631074606433948,4,600547,10.99,6600011.5300000003,"No","No","No",0.09]
[2017,"2011-01-04",1.4428473648186173,18,390210,12.99,5068827.9000000004,"Yes","Yes","No",0.15]
[2018,"2012-03-04",0.27926078028747431,8,579494,2.99,1732687.06,"Yes","No","No",0.09]
[2021,"2005-12-14",6.4996577686516082,10,364908,3.99,1455982.9200000002,"No","Yes","Yes",0.2]
[2021,"2003-04-05",9.1937029431895958,12,393131,9.99,3927378.69,"No","Yes","Yes",0.2]
[2029,"2011-02-20",1.3141683778234086,6,350882,3.99,1400019.1800000002,"Yes","No","No",0.09]
[2032,"2006-10-04",5.6947296372347704,21,204840,23.99,4914111.5999999996,"No","Yes","Yes",0.2]
[2033,"2012-09-15",-0.25462012320328542,22,635982,7.99,5081496.18,"Yes","Yes","No",0.15]
[2034,"2004-10-21",7.6468172484599588,17,662103,7.99,5290202.97,"No","Yes","Yes",0.2]
[2036,"2012-01-31",0.36960985626283366,18,636018,2.99,1901693.82,"Yes","Yes","No",0.15]
[2037,"2003-06-08",9.0184804928131417,6,231886,2.99,693339.14,"No","Yes","No",0.09]
[2037,"2000-07-16",11.912388774811772,4,693802,7.99,5543477.9800000004,"No","Yes","Yes",0.2]
[2038,"2008-03-02",4.2847364818617386,10,230168,2.99,688202.32000000007,"No","Yes","No",0.09]
[2042,"2010-09-07",1.7686516084873374,23,341112,23.99,8183276.8799999999,"Yes","Yes","No",0.15]
[2042,"2012-05-14",8.4873374401095145E-2,6,261922,9.99,2616600.7800000003,"Yes","No","No",0.09]
[2044,"2008-02-15",4.3285420944558526,11,551936,5.99,3306096.6400000001,"No","Yes","No",0.15]
[2051,"2001-09-06",10.770704996577686,21,316536,9.99,3162194.64,"No","Yes","Yes",0.2]
[2052,"2012-11-17",-0.4271047227926078,5,167296,15.99,2675063.04,"Yes","No","No",0.09]
[2054,"2001-10-01",10.702258726899384,9,21917,7.99,175116.83000000002,"No","Yes","No",0.09]
[2054,"2003-01-03",9.4455852156057496,12,340591,7.99,2721322.09,"No","Yes","Yes",0.2]
[2054,"2002-06-25",9.9712525667351137,8,649602,15.99,10387135.98,"No","Yes","Yes",0.2]
[2056,"2008-05-31",4.0383299110198498,1,263557,12.99,3423605.43,"No","No","No",0.09]
[2056,"2009-12-27",2.4640657084188913,8,552252,10.99,6069249.4800000004,"No","No","No",0.09]
[2056,"2007-03-01",5.28952772073922,18,435451,2.99,{"$f":"Number_of_Books_Sold*Sell_Price","v":1301998.49},{"$f":"IF(AND(Years_Under_Contract<2,Number_of_Books_in_Print>4)=TRUE,\"Yes\",\"No\")","v":"No"},{"$f":"IF(OR(Years_Under_Contract>5,Number_of_Books_in_Print>=10)=TRUE,\"Yes\",\"No\")","v":"Yes"},{"$f":"IF(AND(Years_Under_Contract>5,OR(Number_of_Books_in_Print>350000,Income_Earned>=1000000))=TRUE,\"Yes\",\"No\")","v":"Yes"},{"$f":"IF(AND(Years_Under_Contract>5,OR(Number_of_Books_in_Print>10,Income_Earned>1000000)),0.2,IF(Number_of_Books_in_Print>10,0.15,0.09))","v":0.2}]
[2059,"2011-03-17",1.2457221081451062,9,557302,9.99,5567446.9800000004,"Yes","No","No",0.09]
[2060,"2011-09-30",0.70636550308008217,21,346469,23.99,8311791.3099999996,"Yes","Yes","No",0.15]
[2062,"2001-06-22",10.978781656399725,16,399716,3.99,1594866.84,"No","Yes","Yes",0.2]
[2064,"2007-01-27",5.3798767967145791,22,410658,15.99,6566421.4199999999,"No","Yes","Yes",0.2]
[2065,"2000-06-03",12.030116358658454,11,300690,12.99,3905963.1,"No","Yes","Yes",0.2]
[2069,"2011-11-20",0.56673511293634493,24,13931,5.99,83446.69,"Yes","Yes","No",0.15]
[2070,"2011-03-09",1.267624914442163,12,619105,10.99,6803963.9500000002,"Yes","Yes","No",0.15]
[2074,"2006-02-12",6.3353867214236823,16,297428,23.99,7135297.7199999997,"No","Yes","Yes",0.2]
[2075,"2010-05-19",2.0725530458590007,9,358421,5.99,2146941.79,"No","No","No",0.09]
[2076,"2011-08-02",0.86789869952087606,25,148856,23.99,3571055.44,"Yes","Yes","No",0.15]
[2079,"2005-04-06",7.1895961670088981,7,413174,3.99,1648564.26,"No","Yes","Yes",0.2]
[2079,"2002-08-28",9.7960301163586578,19,131958,7.99,1054344.42,"No","Yes","Yes",0.2]
[2090,"2006-03-03",6.2833675564681721,13,403927,10.99,4439157.7300000004,"No","Yes","Yes",0.2]
[2091,"2005-10-15",6.6639288158795349,5,27962,10.99,307302.38,"No","Yes","No",0.09]
[2091,"2005-09-08",6.7652292950034223,17,382524,3.99,1526270.76,"No","Yes","Yes",0.2]
[2094,"2002-08-23",9.8097193702943191,17,18041,10.99,198270.59,"No","Yes","No",0.2]
[2095,"2000-07-29",11.876796714579056,19,56571,2.99,169147.29,"No","Yes","No",0.2]
[2096,"2008-06-19",3.9863107460643397,2,58720,3.99,234292.80000000002,"No","No","No",0.09]
[2097,"2010-09-18",1.7385352498288844,16,48102,2.99,143824.98000000001,"Yes","Yes","No",0.15]
[2099,"2003-03-25",9.2238193018480494,25,320751,5.99,1921298.49,"No","Yes","Yes",0.2]
[2100,"2012-05-25",5.4757015742642023E-2,9,125042,2.99,373875.58,"Yes","No","No",0.09]
[2100,"2004-11-21",7.5619438740588638,6,392400,2.99,1173276,"No","Yes","Yes",0.2]
[2101,"2000-02-10",12.342231348391513,23,183440,9.99,1832565.6,"No","Yes","Yes",0.2]
[2101,"2008-04-27",4.131416837782341,9,630251,9.99,6296207.4900000002,"No","No","No",0.09]
[2102,"2006-03-26",6.2203969883641346,11,167197,12.99,2171889.0300000003,"No","Yes","Yes",0.2]
[2106,"2002-08-26",9.801505817932922,10,89610,12.99,1164033.8999999999,"No","Yes","Yes",0.2]
[2106,"2012-01-15",0.4134154688569473,17,310495,7.99,2480855.0500000003,"Yes","Yes","No",0.15]
[2108,"2004-02-17",8.3230663928815876,3,268524,15.99,4293698.76,"No","Yes","Yes",0.2]
[2110,"2009-08-13",2.8364134154688569,16,582283,5.99,3487875.17,"No","Yes","No",0.15]
[2110,"2004-06-09",8.0136892539356612,5,93340,7.99,745786.6,"No","Yes","No",0.09]
[2111,"2003-09-19",8.736481861738536,2,652533,5.99,3908672.67,"No","Yes","Yes",0.2]
[2114,"2008-03-17",4.2436687200547567,8,647848,2.99,1937065.5200000003,"No","No","No",0.09]
[2116,"2011-12-19",0.48733744010951402,15,323856,2.99,968329.44000000006,"Yes","Yes","No",0.15]
[2119,"2002-07-27",9.8836413415468858,22,37297,2.99,111518.03000000001,"No","Yes","No",0.2]
[2122,"2009-08-30",2.7898699520876113,19,177468,10.99,1950373.32,"No","Yes","No",0.15]
[2125,"2006-10-16",5.6618754277891856,13,310488,5.99,1859823.12,"No","Yes","Yes",0.2]
[2127,"2010-03-09",2.2669404517453797,11,417378,5.99,2500094.2200000002,"No","Yes","No",0.15]
[2128,"2000-01-22",12.394250513347023,2,475079,10.99,5221118.21,"No","Yes","Yes",0.2]
[2130,"2006-04-06",6.1902806297056809,20,362097,7.99,2893155.0300000003,"No","Yes","Yes",0.2]
[2130,"2002-05-28",10.047912388774812,22,461738,12.99,5997976.6200000001,"No","Yes","Yes",0.2]
[2131,"2006-06-17",5.9931553730321694,12,356303,12.99,4628375.97,"No","Yes","Yes",0.2]
[2132,"2002-10-15",9.6646132785763168,23,666993,7.99,5329274.07,"No","Yes","Yes",0.2]
[2134,"2009-12-07",2.5188227241615331,21,394822,5.99,2364983.7800000003,"No","Yes","No",0.15]
[2138,"2009-08-05",2.8583162217659139,2,530222,3.99,2115585.7800000003,"No","No","No",0.09]
[2139,"2010-01-31",2.3682409308692676,6,471918,15.99,7545968.8200000003,"No","No","No",0.09]
[2146,"2007-11-26",4.5503080082135527,1,279443,9.99,2791635.57,"No","No","No",0.09]
[2148,"2005-02-17",7.3210130047912392,3,520045,2.99,1554934.55,"No","Yes","Yes",0.2]
[2155,"2001-02-27",11.293634496919918,6,68656,9.99,685873.44000000006,"No","Yes","No",0.09]
[2155,"2003-07-07",8.9390828199863108,11,363321,2.99,1086329.79,"No","Yes","Yes",0.2]
[2155,"2000-12-16",11.493497604380561,17,411823,9.99,4114111.77,"No","Yes","Yes",0.2]
[2156,"2009-08-18",2.8227241615331966,25,74471,9.99,743965.29,"No","Yes","No",0.15]
[2160,"2009-05-01",3.1211498973305956,5,118840,3.99,474171.60000000003,"No","No","No",0.09]
[2163,"2006-06-04",6.0287474332648872,7,53842,2.99,160987.58000000002,"No","Yes","No",0.09]
[2165,"2009-02-03",3.3593429158110881,22,521646,2.99,1559721.54,"No","Yes","No",0.15]
[2167,"2000-01-21",12.396988364134154,17,398290,3.99,1589177.1,"No","Yes","Yes",0.2]
[2171,"2001-06-07",11.019849418206707,13,434860,9.99,4344251.4000000004,"No","Yes","Yes",0.2]
[2180,"2004-11-07",7.6002737850787137,12,342729,2.99,1024759.7100000001,"No","Yes","Yes",0.2]
[2180,"2003-10-29",8.6269678302532515,20,254136,3.99,1014002.64,"No","Yes","Yes",0.2]
[2183,"2011-06-11",1.0102669404517455,11,302011,12.99,3923122.89,"Yes","Yes","No",0.15]
[2184,"2001-10-29",10.625598904859686,2,187006,10.99,2055195.94,"No","Yes","Yes",0.2]
[2187,"2006-06-23",5.976728268309377,7,4567,7.99,36490.33,"No","Yes","No",0.09]
[2187,"2000-10-11",11.674195756331279,23,433828,10.99,4767769.72,"No","Yes","Yes",0.2]
[2189,"2012-10-24",-0.3613963039014374,15,659104,23.99,15811904.959999999,"Yes","Yes","No",0.15]
[2190,"2011-01-24",1.3880903490759753,21,346382,9.99,{"$f":"Number_of_Books_Sold*Sell_Price","v":3460356.18},{"$f":"IF(AND(Years_Under_Contract<2,Number_of_Books_in_Print>4)=TRUE,\"Yes\",\"No\")","v":"Yes"},{"$f":"IF(OR(Years_Under_Contract>5,Number_of_Books_in_Print>=10)=TRUE,\"Yes\",\"No\")","v":"Yes"},{"$f":"IF(AND(Years_Under_Contract>5,OR(Number_of_Books_in_Print>350000,Income_Earned>=1000000))=TRUE,\"Yes\",\"No\")","v":"No"},{"$f":"IF(AND(Years_Under_Contract>5,OR(Number_of_Books_in_Print>10,Income_Earned>1000000)),0.2,IF(Number_of_Books_in_Print>10,0.15,0.09))","v":0.15}]
[2192,"2000-08-27",11.797399041752225,18,365267,3.99,1457415.33,"No","Yes","Yes",0.2]
[2193,"2001-04-30",11.123887748117728,22,469352,3.99,1872714.4800000002,"No","Yes","Yes",0.2]
[2198,"2010-04-22",2.1464750171115674,2,44772,2.99,133868.28,"No","No","No",0.09]
[2199,"2006-04-01",6.2039698836413413,18,523274,2.99,1564589.26,"No","Yes","Yes",0.2]
[2199,"2005-08-22",6.8117727583846683,7,151809,5.99,909335.91,"No","Yes","No",0.09]
[2200,"2008-11-17",3.5728952772073921,3,660998,5.99,3959378.02,"No","No","No",0.09]
[2201,"2004-01-08",8.4325804243668721,1,449177,9.99,4487278.2300000004,"No","Yes","Yes",0.2]
[2205,"2011-11-21",0.56399726214921286,23,267361,9.99,2670936.39,"Yes","Yes","No",0.15]
[2207,"2010-07-04",1.946611909650924,10,275683,9.99,2754073.17,"Yes","Yes","No",0.09]
[2207,"2010-08-25",1.8042436687200547,6,153196,15.99,2449604.04,"Yes","No","No",0.09]
[2207,"2002-09-11",9.7577002053388089,7,84542,2.99,252780.58000000002,"No","Yes","No",0.09]
[2210,"2004-08-11",7.8412046543463383,23,385482,2.99,1152591.1800000002,"No","Yes","Yes",0.2]
[2211,"2010-10-10",1.678302532511978,16,561104,2.99,1677700.9600000002,"Yes","Yes","No",0.15]
[2214,"2001-02-23",11.304585900068446,23,264680,2.99,791393.20000000007,"No","Yes","No",0.2]
[2217,"2004-03-02",8.2847364818617386,22,684754,10.99,7525446.46,"No","Yes","Yes",0.2]
[2218,"2001-05-11",11.093771389459274,5,574050,7.99,4586659.5,"No","Yes","Yes",0.2]
[2218,"2006-05-31",6.0396988364134154,7,183707,10.99,2018939.93,"No","Yes","Yes",0.2]
[2219,"2006-07-10",5.9301848049281318,3,309277,3.99,1234015.23,"No","Yes","Yes",0.2]
[2219,"2005-05-21",7.0663928815879533,15,327412,23.99,7854613.8799999999,"No","Yes","Yes",0.2]
[2220,"2003-04-23",9.1444216290212186,24,350850,9.99,3504991.5,"No","Yes","Yes",0.2]
[2220,"2009-12-21",2.4804928131416837,8,66837,7.99,534027.63,"No","No","No",0.09]
[2221,"2010-01-23",2.3901437371663246,19,175519,5.99,1051358.81,"No","Yes","No",0.15]
[2223,"2004-08-11",7.8412046543463383,21,677769,9.99,6770912.3100000005,"No","Yes","Yes",0.2]
[2224,"2000-02-25",12.301163586584531,21,428122,2.99,1280084.78,"No","Yes","Yes",0.2]
[2227,"2000-06-07",12.019164955509925,2,227001,7.99,1813737.99,"No","Yes","Yes",0.2]
[2227,"2002-11-22",9.5605749486652982,1,466927,7.99,3730746.73,"No","Yes","Yes",0.2]
[2231,"2004-08-25",7.8028747433264884,9,693605,5.99,4154693.95,"No","Yes","Yes",0.2]
[2232,"2004-02-17",8.3230663928815876,24,561189,9.99,5606278.1100000003,"No","Yes","Yes",0.2]
[2236,"2000-06-01",12.035592060232718,24,311071,9.99,3107599.29,"No","Yes","Yes",0.2]
[2237,"2006-03-12",6.2587268993839835,7,543210,3.99,2167407.9,"No","Yes","Yes",0.2]
[2237,"2011-07-26",0.88706365503080087,16,587800,9.99,5872122,"Yes","Yes","No",0.15]
[2248,"2008-02-11",4.3394934976043809,23,145549,5.99,871838.51,"No","Yes","No",0.15]
[2250,"2004-12-18",7.4880219028062971,6,240953,3.99,961402.47000000009,"No","Yes","No",0.09]
[2254,"2007-05-21",5.0677618069815198,15,326625,3.99,1303233.75,"No","Yes","Yes",0.2]
[2256,"2000-04-19",12.153319644079398,14,4056,23.99,97303.439999999988,"No","Yes","No",0.2]
[2259,"2008-09-21",3.7289527720739222,4,348630,10.99,3831443.7,"No","No","No",0.09]
[2263,"2001-02-19",11.315537303216974,8,352524,10.99,3874238.7600000002,"No","Yes","Yes",0.2]
[2264,"2011-06-06",1.0239561943874058,6,501268,3.99,2000059.32,"Yes","No","No",0.09]
[2266,"2011-11-12",0.58863791923340181,2,577430,12.99,7500815.7000000002,"No","No","No",0.09]
[2270,"2000-02-11",12.33949349760438,18,542359,7.99,4333448.41,"No","Yes","Yes",0.2]
[2273,"2007-06-20",4.9856262833675569,8,228695,10.99,2513358.0500000003,"No","No","No",0.09]
[2275,"2008-09-18",3.7371663244353184,8,514734,12.99,6686394.6600000001,"No","No","No",0.09]
[2275,"2003-02-24",9.3032169746748803,10,646633,12.99,8399762.6699999999,"No","Yes","Yes",0.2]
[2276,"2010-11-29",1.5414099931553731,25,497341,10.99,5465777.5899999999,"Yes","Yes","No",0.15]
[2277,"2003-02-25",9.3004791238877473,23,402837,10.99,4427178.63,"No","Yes","Yes",0.2]
[2279,"2009-02-17",3.3210130047912387,8,126694,7.99,1012285.06,"No","No","No",0.09]
[2280,"2010-03-27",2.2176591375770021,13,195327,23.99,4685894.7299999995,"No","Yes","No",0.15]
[2281,"2001-04-19",11.154004106776181,1,383093,2.99,1145448.07,"No","Yes","Yes",0.2]
[2282,"2010-08-10",1.8453114305270362,9,95455,12.99,1239960.45,"Yes","No","No",0.09]
[2283,"2007-07-17",4.9117043121149901,1,152685,5.99,914583.15,"No","No","No",0.09]
[2284,"2006-09-28",5.7111567419575637,3,575923,2.99,1722009.77,"No","Yes","Yes",0.2]
[2285,"2008-12-14",3.4989733059548254,7,259137,2.99,774819.63,"No","No","No",0.09]
[2287,"2006-10-30",5.6235455167693358,9,131267,12.99,1705158.33,"No","Yes","Yes",0.2]
[2289,"2004-03-17",8.2436687200547567,15,235795,5.99,1412412.05,"No","Yes","Yes",0.2]
[2289,"2006-08-25",5.8042436687200549,17,24474,2.99,73177.260000000009,"No","Yes","No",0.2]
[2292,"2003-08-28",8.7967145790554415,7,139000,12.99,1805610,"No","Yes","Yes",0.2]
[2299,"2011-05-01",1.1225188227241616,25,232049,9.99,2318169.5100000002,"Yes","Yes","No",0.15]
[2301,"2003-06-11",9.0102669404517446,11,504676,7.99,4032361.24,"No","Yes","Yes",0.2]
[2304,"2005-01-03",7.4442162902121831,9,675401,7.99,5396453.9900000002,"No","Yes","Yes",0.2]
[2308,"2000-11-04",11.60848733744011,13,690304,3.99,2754312.96,"No","Yes","Yes",0.2]
[2314,"2003-10-31",8.6214921286789874,10,593436,23.99,14236529.639999999,"No","Yes","Yes",0.2]
[2315,"2009-02-05",3.353867214236824,8,278991,10.99,3066111.09,"No","No","No",0.09]
[2318,"2003-01-22",9.3935660506502394,7,489459,5.99,2931859.41,"No","Yes","Yes",0.2]
[2319,"2007-02-28",5.292265571526352,9,601620,2.99,{"$f":"Number_of_Books_Sold*Sell_Price","v":1798843.8},{"$f":"IF(AND(Years_Under_Contract<2,Number_of_Books_in_Print>4)=TRUE,\"Yes\",\"No\")","v":"No"},{"$f":"IF(OR(Years_Under_Contract>5,Number_of_Books_in_Print>=10)=TRUE,\"Yes\",\"No\")","v":"Yes"},{"$f":"IF(AND(Years_Under_Contract>5,OR(Number_of_Books_in_Print>350000,Income_Earned>=1000000))=TRUE,\"Yes\",\"No\")","v":"Yes"},{"$f":"IF(AND(Years_Under_Contract>5,OR(Number_of_Books_in_Print>10,Income_Earned>1000000)),0.2,IF(Number_of_Books_in_Print>10,0.15,0.09))","v":0.2}]
[2320,"2002-04-09",10.182067077344286,15,504615,10.99,5545718.8500000006,"No","Yes","Yes",0.2]
[2325,"2011-01-18",1.4045174537987679,4,21267,10.99,233724.33000000002,"No","No","No",0.09]
[2326,"2002-06-27",9.9657768651608496,24,406846,7.99,3250699.54,"No","Yes","Yes",0.2]
[2329,"2002-04-11",10.17659137577002,18,144212,15.99,2305949.88,"No","Yes","Yes",0.2]
[2331,"2004-06-29",7.9589322381930181,14,280008,12.99,3637303.92,"No","Yes","Yes",0.2]
[2331,"2007-01-11",5.4236824093086931,14,492111,10.99,5408299.8899999997,"No","Yes","Yes",0.2]
[2334,"2000-10-22",11.644079397672828,2,450795,7.99,3601852.0500000003,"No","Yes","Yes",0.2]
[2335,"2011-12-12",0.50650239561943877,21,699000,2.99,2090010.0000000002,"Yes","Yes","No",0.15]
[2337,"2011-07-22",0.89801505817932925,20,111382,7.99,889942.18,"Yes","Yes","No",0.15]
[2339,"2006-02-14",6.3299110198494182,10,448613,10.99,4930256.87,"No","Yes","Yes",0.2]
[2343,"2005-08-29",6.792607802874743,5,652787,12.99,8479703.1300000008,"No","Yes","Yes",0.2]
[2345,"2012-05-13",8.761122518822724E-2,14,491163,12.99,6380207.3700000001,"Yes","Yes","No",0.15]
[2347,"2000-01-11",12.424366872005475,21,481315,3.99,1920446.85,"No","Yes","Yes",0.2]
[2347,"2007-11-23",4.5585215605749489,25,105193,2.99,314527.07,"No","Yes","No",0.15]
[2349,"2004-01-23",8.3915126625598901,15,393011,3.99,1568113.8900000001,"No","Yes","Yes",0.2]
[2350,"2009-09-30",2.7049965776865159,19,430900,23.99,10337291,"No","Yes","No",0.15]
[2351,"2006-05-11",6.0944558521560577,21,300164,7.99,2398310.36,"No","Yes","Yes",0.2]
[2354,"2004-12-04",7.526351813826146,9,429843,12.99,5583660.5700000003,"No","Yes","Yes",0.2]
[2360,"2000-01-09",12.429842573579739,10,531869,10.99,5845240.3100000005,"No","Yes","Yes",0.2]
[2361,"2002-02-04",10.35728952772074,7,161690,12.99,2100353.1,"No","Yes","Yes",0.2]
[2362,"2012-11-17",-0.4271047227926078,10,244868,7.99,1956495.32,"Yes","Yes","No",0.09]
[2364,"2003-06-11",9.0102669404517446,16,407418,3.99,1625597.82,"No","Yes","Yes",0.2]
[2368,"2005-08-16",6.8281998631074607,13,428159,15.99,6846262.4100000001,"No","Yes","Yes",0.2]
[2368,"2000-10-09",11.679671457905544,9,431529,23.99,10352380.709999999,"No","Yes","Yes",0.2]
[2376,"2006-11-15",5.5797399041752227,12,143328,12.99,1861830.72,"No","Yes","Yes",0.2]
[2377,"2009-06-24",2.9733059548254621,20,663303,10.99,7289699.9699999997,"No","Yes","No",0.15]
[2378,"2011-06-25",0.97193702943189597,6,40276,15.99,644013.24,"Yes","No","No",0.09]
[2379,"2000-10-31",11.619438740588638,13,634343,10.99,6971429.5700000003,"No","Yes","Yes",0.2]
[2379,"2004-02-04",8.3586584531143053,10,265376,2.99,793474.24000000011,"No","Yes","No",0.09]
[2382,"2005-10-28",6.6283367556468171,16,598839,3.99,2389367.6100000003,"No","Yes","Yes",0.2]
[2383,"2006-03-31",6.2067077344284733,20,172143,9.99,1719708.57,"No","Yes","Yes",0.2]
[2384,"2004-02-04",8.3586584531143053,22,22609,12.99,293690.91000000003,"No","Yes","No",0.2]
[2387,"2006-04-02",6.2012320328542092,22,552194,23.99,13247134.059999999,"No","Yes","Yes",0.2]
[2388,"2001-07-13",10.921286789869953,19,278990,10.99,3066100.1,"No","Yes","Yes",0.2]
[2390,"2010-10-02",1.700205338809035,7,556513,2.99,1663973.87,"Yes","No","No",0.09]
[2393,"2001-05-23",11.060917180013689,3,158009,15.99,2526563.91,"No","Yes","Yes",0.2]
[2394,"2002-05-31",10.039698836413416,21,37936,7.99,303108.64,"No","Yes","No",0.2]
[2394,"2000-06-17",11.991786447638603,20,304590,12.99,3956624.1,"No","Yes","Yes",0.2]
[2396,"2004-10-29",7.6249144421629023,14,302703,5.99,1813190.97,"No","Yes","Yes",0.2]
[2397,"2000-11-21",11.561943874058864,7,19854,2.99,59363.460000000006,"No","Yes","No",0.09]
[2398,"2006-08-18",5.8234086242299794,22,564562,2.99,1688040.3800000001,"No","Yes","Yes",0.2]
[2401,"2007-11-15",4.5804243668720055,24,131644,10.99,1446767.56,"No","Yes","No",0.15]
[2402,"2006-02-01",6.3655030800821359,4,178575,2.99,533939.25,"No","Yes","No",0.09]
[2404,"2006-02-05",6.3545516769336068,21,177300,9.99,1771227,"No","Yes","Yes",0.2]
[2404,"2004-11-17",7.5728952772073921,6,574585,2.99,1718009.1500000001,"No","Yes","Yes",0.2]
[2406,"2012-12-07",-0.48186173853524983,25,426515,7.99,3407854.85,"Yes","Yes","No",0.15]
[2408,"2007-11-28",4.5448323066392877,24,441164,12.99,5730720.3600000003,"No","Yes","No",0.15]
[2408,"2004-05-01",8.1204654346338128,18,638012,15.99,10201811.880000001,"No","Yes","Yes",0.2]
[2410,"2006-10-01",5.7029431895961666,20,415941,9.99,4155250.5900000003,"No","Yes","Yes",0.2]
[2412,"2000-04-20",12.150581793292266,19,497467,2.99,1487426.33,"No","Yes","Yes",0.2]
[2412,"2003-09-25",8.7200547570157418,9,458020,2.99,1369479.8,"No","Yes","Yes",0.2]
[2416,"2009-03-30",3.2087611225188226,2,362472,2.99,1083791.28,"No","No","No",0.09]
[2417,"2007-02-15",5.3278576317590689,18,340561,2.99,1018277.3900000001,"No","Yes","Yes",0.2]
[2418,"2003-04-12",9.1745379876796722,19,288112,12.99,3742574.88,"No","Yes","Yes",0.2]
[2419,"2007-05-02",5.1197809719370291,25,3598,2.99,10758.02,"No","Yes","No",0.2]
[2420,"2002-08-03",9.8644763860369604,3,425634,15.99,6805887.6600000001,"No","Yes","Yes",0.2]
[2422,"2003-01-15",9.4127310061601648,12,181067,2.99,541390.33000000007,"No","Yes","No",0.2]
[2427,"2010-07-01",1.9548254620123204,18,267995,9.99,2677270.0500000003,"Yes","Yes","No",0.15]
[2429,"2011-09-29",0.70910335386721424,19,393331,7.99,3142714.69,"Yes","Yes","No",0.15]
[2429,"2001-09-24",10.721423682409309,13,459842,15.99,7352873.5800000001,"No","Yes","Yes",0.2]
[2429,"2011-06-19",0.9883641341546886,24,683391,12.99,8877249.0899999999,"Yes","Yes","No",0.15]
[2430,"2007-02-08",5.3470225872689943,11,622169,12.99,8081975.3100000005,"No","Yes","Yes",0.2]
[2430,"2006-04-21",6.1492128678986999,12,22979,9.99,229560.21,"No","Yes","No",0.2]
[2432,"2001-12-18",10.488706365503081,16,9584,10.99,{"$f":"Number_of_Books_Sold*Sell_Price","v":105328.16},{"$f":"IF(AND(Years_Under_Contract<2,Number_of_Books_in_Print>4)=TRUE,\"Yes\",\"No\")","v":"No"},{"$f":"IF(OR(Years_Under_Contract>5,Number_of_Books_in_Print>=10)=TRUE,\"Yes\",\"No\")","v":"Yes"},{"$f":"IF(AND(Years_Under_Contract>5,OR(Number_of_Books_in_Print>350000,Income_Earned>=1000000))=TRUE,\"Yes\",\"No\")","v":"No"},{"$f":"IF(AND(Years_Under_Contract>5,OR(Number_of_Books_in_Print>10,Income_Earned>1000000)),0.2,IF(Number_of_Books_in_Print>10,0.15,0.09))","v":0.2}]
[2433,"2002-10-28",9.6290212183436008,9,586851,2.99,1754684.4900000002,"No","Yes","Yes",0.2]
[2436,"2002-09-09",9.763175906913073,12,664385,23.99,15938596.149999999,"No","Yes","Yes",0.2]
[2436,"2009-09-21",2.729637234770705,15,199309,2.99,595933.91,"No","Yes","No",0.15]
[2436,"2007-09-29",4.7091033538672145,21,480134,10.99,5276672.66,"No","Yes","No",0.15]
[2441,"2001-06-27",10.965092402464066,14,602808,9.99,6022051.9199999999,"No","Yes","Yes",0.2]
[2444,"2002-04-04",10.195756331279945,16,602670,10.99,6623343.2999999998,"No","Yes","Yes",0.2]
[2444,"2012-05-23",6.0232717316906229E-2,19,490995,5.99,2941060.0500000003,"Yes","Yes","No",0.15]
[2445,"2011-02-12",1.3360711841204653,20,649404,7.99,5188737.96,"Yes","Yes","No",0.15]
[2451,"2008-12-29",3.4579055441478439,21,168055,3.99,670539.45000000007,"No","Yes","No",0.15]
[2453,"2000-03-22",12.229979466119097,2,193276,9.99,1930827.24,"No","Yes","Yes",0.2]
[2456,"2011-12-04",0.52840520191649554,23,563534,2.99,1684966.6600000001,"Yes","Yes","No",0.15]
[2456,"2000-12-15",11.496235455167694,20,300382,2.99,898142.18,"No","Yes","No",0.2]
[2459,"2007-06-11",5.0102669404517455,1,447781,2.99,1338865.1900000002,"No","Yes","Yes",0.2]
[2460,"2002-03-03",10.283367556468173,18,182104,12.99,2365530.96,"No","Yes","Yes",0.2]
[2460,"2002-09-04",9.7768651608487342,7,177805,7.99,1420661.95,"No","Yes","Yes",0.2]
[2461,"2001-12-21",10.480492813141684,14,480624,10.99,5282057.76,"No","Yes","Yes",0.2]
[2464,"2002-12-02",9.5331964407939775,25,8744,23.99,209768.56,"No","Yes","No",0.2]
[2464,"2009-10-25",2.6365503080082138,7,287169,3.99,1145804.31,"No","No","No",0.09]
[2464,"2010-12-29",1.4592744695414099,25,404167,2.99,1208459.33,"Yes","Yes","No",0.15]
[2467,"2007-11-19",4.5694729637234772,3,275492,2.99,823721.08000000007,"No","No","No",0.09]
[2467,"2007-05-31",5.0403832991101982,6,521744,2.99,1560014.56,"No","Yes","Yes",0.2]
[2468,"2006-10-22",5.6454483230663932,2,521571,12.99,6775207.29,"No","Yes","Yes",0.2]
[2470,"2002-04-15",10.165639972621491,12,577697,5.99,3460405.0300000003,"No","Yes","Yes",0.2]
[2473,"2005-01-08",7.4305270362765228,25,657159,9.99,6565018.4100000001,"No","Yes","Yes",0.2]
[2474,"2000-08-25",11.802874743326489,18,431514,2.99,1290226.8600000001,"No","Yes","Yes",0.2]
[2474,"2012-06-02",3.2854209445585217E-2,17,114745,12.99,1490537.55,"Yes","Yes","No",0.15]
[2475,"2002-03-24",10.225872689938399,22,661376,10.99,7268522.2400000002,"No","Yes","Yes",0.2]
[2478,"2005-02-22",7.3073237508555779,11,497403,2.99,1487234.9700000002,"No","Yes","Yes",0.2]
[2482,"2006-12-17",5.4921286789869956,23,290663,10.99,3194386.37,"No","Yes","Yes",0.2]
[2483,"2004-06-06",8.0219028062970565,2,156567,3.99,624702.33000000007,"No","Yes","No",0.09]
[2485,"2000-02-19",12.317590691307323,7,446436,5.99,2674151.64,"No","Yes","Yes",0.2]
[2486,"2010-09-14",1.7494866529774127,1,101570,12.99,1319394.3,"No","No","No",0.09]
[2491,"2011-09-19",0.73648186173853525,3,76964,12.99,999762.36,"No","No","No",0.09]
[2491,"2012-08-18",-0.17796030116358658,6,276964,7.99,2212942.36,"Yes","No","No",0.09]
[2491,"2003-06-07",9.0212183436002746,19,619819,2.99,1853258.81,"No","Yes","Yes",0.2]
[2493,"2004-01-03",8.4462696783025333,4,304649,9.99,3043443.5100000002,"No","Yes","Yes",0.2]
[2494,"2007-07-30",4.8761122518822724,7,627148,9.99,6265208.5200000005,"No","No","No",0.09]
[2496,"2005-08-15",6.8309377138945928,22,616375,2.99,1842961.2500000002,"No","Yes","Yes",0.2]
[2498,"2001-05-30",11.041752224503764,2,75483,9.99,754075.17,"No","Yes","No",0.09]
[2498,"2000-09-24",11.720739219712526,1,675254,12.99,8771549.4600000009,"No","Yes","Yes",0.2]
[2498,"2004-07-25",7.8877481177275834,1,254742,2.99,761678.58000000007,"No","Yes","No",0.09]
[2502,"2010-12-28",1.462012320328542,19,274182,7.99,2190714.1800000002,"Yes","Yes","No",0.15]
[2503,"2009-07-03",2.9486652977412731,15,483578,5.99,2896632.22,"No","Yes","No",0.15]
[2511,"2004-06-20",7.9835728952772076,3,166091,2.99,496612.09,"No","Yes","No",0.09]
[2514,"2000-07-26",11.885010266940451,12,582362,23.99,13970864.379999999,"No","Yes","Yes",0.2]
[2515,"2004-03-12",8.2573579739904179,4,684523,12.99,8891953.7699999996,"No","Yes","Yes",0.2]
[2518,"2008-02-29",4.2902121834360027,6,518659,7.99,4144085.41,"No","No","No",0.09]
[2524,"2006-12-01",5.5359342915811087,7,341000,2.99,1019590.0000000001,"No","Yes","Yes",0.2]
[2525,"2012-04-06",0.18891170431211499,2,309962,5.99,1856672.3800000001,"No","No","No",0.09]
[2525,"2002-08-06",9.8562628336755651,2,529945,10.99,5824095.5499999998,"No","Yes","Yes",0.2]
[2528,"2004-09-23",7.7234770704996576,19,179864,3.99,717657.36,"No","Yes","No",0.2]
[2529,"2002-08-11",9.8425735797399039,20,299811,7.99,2395489.89,"No","Yes","Yes",0.2]
[2530,"2011-12-10",0.51197809719370291,3,539695,23.99,12947283.049999999,"No","No","No",0.09]
[2535,"2008-01-10",4.4271047227926079,4,6302,7.99,50352.98,"No","No","No",0.09]
[2535,"2011-10-20",0.65160848733744015,15,13485,9.99,134715.15,"Yes","Yes","No",0.15]
[2538,"2006-04-21",6.1492128678986999,19,104993,7.99,838894.07000000007,"No","Yes","No",0.2]
[2540,"2005-12-27",6.4640657084188913,24,362335,23.99,8692416.6499999985,"No","Yes","Yes",0.2]
[2540,"2000-12-10",11.509924709103354,9,504285,12.99,6550662.1500000004,"No","Yes","Yes",0.2]
[2541,"2011-07-10",0.9308692676249144,19,479060,2.99,1432389.4000000001,"Yes","Yes","No",0.15]
[2542,"2011-07-08",0.93634496919917864,9,69519,23.99,1667760.8099999998,"Yes","No","No",0.09]
[2543,"2005-07-05",6.9431895961670085,9,148436,5.99,889131.64,"No","Yes","No",0.09]
[2550,"2004-06-04",8.0273785078713207,22,277647,7.99,2218399.5300000003,"No","Yes","Yes",0.2]
[2552,"2008-01-20",4.3997262149212863,21,557962,15.99,8921812.3800000008,"No","Yes","No",0.15]
[2552,"2012-07-23",-0.10677618069815195,18,483060,23.99,{"$f":"Number_of_Books_Sold*Sell_Price","v":11588609.399999999},{"$f":"IF(AND(Years_Under_Contract<2,Number_of_Books_in_Print>4)=TRUE,\"Yes\",\"No\")","v":"Yes"},{"$f":"IF(OR(Years_Under_Contract>5,Number_of_Books_in_Print>=10)=TRUE,\"Yes\",\"No\")","v":"Yes"},{"$f":"IF(AND(Years_Under_Contract>5,OR(Number_of_Books_in_Print>350000,Income_Earned>=1000000))=TRUE,\"Yes\",\"No\")","v":"No"},{"$f":"IF(AND(Years_Under_Contract>5,OR(Number_of_Books_in_Print>10,Income_Earned>1000000)),0.2,IF(Number_of_Books_in_Print>10,0.15,0.09))","v":0.15}]
[2553,"2011-01-20",1.3990417522245038,12,26304,3.99,104952.96000000001,"Yes","Yes","No",0.15]
[2553,"2011-06-26",0.9691991786447639,15,214200,7.99,1711458,"Yes","Yes","No",0.15]
[2553,"2012-01-24",0.38877481177275841,6,548956,10.99,6033026.4400000004,"Yes","No","No",0.09]
[2554,"2004-11-26",7.5482546201232035,6,91548,10.99,1006112.52,"No","Yes","Yes",0.2]
[2554,"2011-04-11",1.1772758384668036,4,611033,9.99,6104219.6699999999,"No","No","No",0.09]
[2554,"2008-06-05",4.0246406570841886,25,511783,5.99,3065580.17,"No","Yes","No",0.15]
[2559,"2010-04-16",2.1629021218343598,7,310126,9.99,3098158.74,"No","No","No",0.09]
[2564,"2008-01-07",4.4353182751540041,10,608850,2.99,1820461.5000000002,"No","Yes","No",0.09]
[2568,"2012-02-01",0.36687200547570159,17,332290,23.99,7971637.0999999996,"Yes","Yes","No",0.15]
[2569,"2002-11-10",9.593429158110883,7,141546,10.99,1555590.54,"No","Yes","Yes",0.2]
[2570,"2008-07-02",3.9507186858316223,3,279995,9.99,2797150.0500000003,"No","No","No",0.09]
[2572,"2008-04-15",4.1642710472279258,9,496711,5.99,2975298.89,"No","No","No",0.09]
[2573,"2004-02-11",8.33949349760438,16,367659,2.99,1099300.4100000001,"No","Yes","Yes",0.2]
[2574,"2006-04-11",6.1765913757700206,4,158993,2.99,475389.07,"No","Yes","No",0.09]
[2575,"2008-12-19",3.485284052019165,9,359224,10.99,3947871.7600000002,"No","No","No",0.09]
[2577,"2008-12-28",3.460643394934976,19,478951,9.99,4784720.49,"No","Yes","No",0.15]
[2578,"2000-03-10",12.262833675564682,22,650927,2.99,1946271.7300000002,"No","Yes","Yes",0.2]
[2583,"2010-10-31",1.6208076659822039,19,561089,5.99,3360923.1100000003,"Yes","Yes","No",0.15]
[2583,"2005-07-01",6.9541409993155376,11,97922,5.99,586552.78,"No","Yes","No",0.2]
[2592,"2012-11-09",-0.40520191649555098,13,350977,12.99,4559191.2300000004,"Yes","Yes","No",0.15]
[2598,"2003-06-17",8.9938398357289522,16,215608,10.99,2369531.92,"No","Yes","Yes",0.2]
[2598,"2010-12-06",1.5222450376454484,22,102347,5.99,613058.53,"Yes","Yes","No",0.15]
[2599,"2002-12-23",9.4757015742642032,18,457463,5.99,2740203.37,"No","Yes","Yes",0.2]
[2600,"2003-08-29",8.7939767282683086,20,472162,10.99,5189060.38,"No","Yes","Yes",0.2]
[2602,"2005-07-28",6.8802190280629709,22,366059,9.99,3656929.41,"No","Yes","Yes",0.2]
[2609,"2007-06-05",5.0266940451745379,1,505709,3.99,2017778.9100000001,"No","Yes","Yes",0.2]
[2611,"2006-05-13",6.0889801505817935,13,32839,10.99,360900.61,"No","Yes","No",0.2]
[2613,"2009-12-31",2.4531143052703626,18,289786,9.99,2894962.14,"No","Yes","No",0.15]
[2614,"2005-02-23",7.3045859000684459,5,437059,10.99,4803278.41,"No","Yes","Yes",0.2]
[2621,"2004-10-21",7.6468172484599588,23,338809,3.99,1351847.9100000001,"No","Yes","Yes",0.2]
[2623,"2009-03-01",3.2881587953456535,18,176171,23.99,4226342.29,"No","Yes","No",0.15]
[2627,"2004-06-25",7.9698836413415473,4,605014,2.99,1808991.86,"No","Yes","Yes",0.2]
[2632,"2006-04-17",6.1601642710472282,1,350615,7.99,2801413.85,"No","Yes","Yes",0.2]
[2635,"2009-10-18",2.6557152635181382,15,87913,15.99,1405728.87,"No","Yes","No",0.15]
[2635,"2002-04-20",10.151950718685832,8,462271,9.99,4618087.29,"No","Yes","Yes",0.2]
[2635,"2001-03-31",11.206023271731691,18,132625,12.99,1722798.75,"No","Yes","Yes",0.2]
[2635,"2003-06-25",8.9719370294318956,17,264511,12.99,3435997.89,"No","Yes","Yes",0.2]
[2640,"2009-03-11",3.2607802874743328,10,504640,5.99,3022793.6,"No","Yes","No",0.09]
[2646,"2007-12-24",4.473648186173854,23,14784,2.99,44204.160000000003,"No","Yes","No",0.15]
[2650,"2000-04-21",12.147843942505133,20,120171,7.99,960166.29,"No","Yes","No",0.2]
[2654,"2010-08-10",1.8453114305270362,9,69984,7.99,559172.16,"Yes","No","No",0.09]
[2663,"2003-05-14",9.0869267624914443,6,485116,9.99,4846308.84,"No","Yes","Yes",0.2]
[2663,"2010-07-12",1.9247091033538672,7,347094,7.99,2773281.06,"Yes","No","No",0.09]
[2664,"2008-09-15",3.7453798767967146,11,394137,2.99,1178469.6300000001,"No","Yes","No",0.15]
[2667,"2005-11-17",6.5735797399041749,7,50452,5.99,302207.48000000004,"No","Yes","No",0.09]
[2667,"2005-01-15",7.4113620807665983,12,555075,9.99,5545199.25,"No","Yes","Yes",0.2]
[2671,"2003-12-27",8.4654346338124569,6,590405,9.99,5898145.9500000002,"No","Yes","Yes",0.2]
[2671,"2008-02-01",4.3668720054757015,25,318011,15.99,5084995.8899999997,"No","Yes","No",0.15]
[2672,"2010-09-09",1.7631759069130732,8,169931,2.99,508093.69000000006,"Yes","No","No",0.09]
[2672,"2007-08-05",4.85968514715948,8,647795,3.99,2584702.0500000003,"No","No","No",0.09]
[2672,"2008-08-17",3.8247775496235454,2,346875,5.99,2077781.25,"No","No","No",0.09]
[2674,"2011-02-19",1.3169062286105406,15,104339,12.99,1355363.61,"Yes","Yes","No",0.15]
[2674,"2004-12-01",7.5345653661875431,14,684664,5.99,4101137.3600000003,"No","Yes","Yes",0.2]
[2674,"2005-07-25",6.8884325804243671,10,93126,23.99,2234092.7399999998,"No","Yes","Yes",0.2]
[2675,"2000-02-18",12.320328542094456,14,451397,9.99,4509456.03,"No","Yes","Yes",0.2]
[2675,"2004-05-21",8.0657084188911696,21,57169,10.99,628287.31000000006,"No","Yes","No",0.2]
[2676,"2011-05-23",1.0622861054072552,12,638732,2.99,1909808.6800000002,"Yes","Yes","No",0.15]
[2676,"2009-09-07",2.7679671457905544,22,275463,12.99,3578264.37,"No","Yes","No",0.15]
[2677,"2004-12-13",7.5017111567419574,7,470155,12.99,6107313.4500000002,"No","Yes","Yes",0.2]
[2679,"2003-11-20",8.5667351129363443,19,548520,2.99,1640074.8,"No","Yes","Yes",0.2]
[2679,"2001-06-25",10.97056810403833,12,562591,3.99,2244738.0900000003,"No","Yes","Yes",0.2]
[2680,"2006-07-02",5.9520876112251884,14,440343,3.99,1756968.57,"No","Yes","Yes",0.2]
[2680,"2004-06-12",8.0054757015742641,9,389295,12.99,5056942.05,"No","Yes","Yes",0.2]
[2682,"2005-05-19",7.0718685831622174,21,466941,3.99,{"$f":"Number_of_Books_Sold*Sell_Price","v":1863094.59},{"$f":"IF(AND(Years_Under_Contract<2,Number_of_Books_in_Print>4)=TRUE,\"Yes\",\"No\")","v":"No"},{"$f":"IF(OR(Years_Under_Contract>5,Number_of_Books_in_Print>=10)=TRUE,\"Yes\",\"No\")","v":"Yes"},{"$f":"IF(AND(Years_Under_Contract>5,OR(Number_of_Books_in_Print>350000,Income_Earned>=1000000))=TRUE,\"Yes\",\"No\")","v":"Yes"},{"$f":"IF(AND(Years_Under_Contract>5,OR(Number_of_Books_in_Print>10,Income_Earned>1000000)),0.2,IF(Number_of_Books_in_Print>10,0.15,0.09))","v":0.2}]
[2682,"2007-02-05",5.3552361396303905,18,65727,12.99,853793.73,"No","Yes","No",0.2]
[2686,"2011-07-01",0.95550992470910334,18,629864,9.99,6292341.3600000003,"Yes","Yes","No",0.15]
[2687,"2008-01-20",4.3997262149212863,22,357371,3.99,1425910.29,"No","Yes","No",0.15]
[2688,"2002-04-08",10.184804928131417,17,624714,2.99,1867894.86,"No","Yes","Yes",0.2]
[2688,"2005-08-23",6.8090349075975363,11,159869,23.99,3835257.3099999996,"No","Yes","Yes",0.2]
[2688,"2007-02-04",5.3579739904175225,7,681111,2.99,2036521.8900000001,"No","Yes","Yes",0.2]
[2691,"2002-02-06",10.351813826146476,2,146312,9.99,1461656.8800000001,"No","Yes","Yes",0.2]
[2692,"2005-04-01",7.2032854209445585,25,471525,9.99,4710534.75,"No","Yes","Yes",0.2]
[2693,"2003-10-23",8.6433949349760439,14,208586,2.99,623672.14,"No","Yes","No",0.2]
[2695,"2000-09-18",11.737166324435318,3,186914,7.99,1493442.86,"No","Yes","Yes",0.2]
[2696,"2012-04-20",0.15058179329226556,13,399795,2.99,1195387.05,"Yes","Yes","No",0.15]
[2697,"2010-02-16",2.324435318275154,9,275679,10.99,3029712.21,"No","No","No",0.09]
[2698,"2005-05-01",7.1211498973305956,19,529278,2.99,1582541.2200000002,"No","Yes","Yes",0.2]
[2700,"2000-12-25",11.468856947296372,16,209050,3.99,834109.5,"No","Yes","No",0.2]
[2702,"2002-11-08",9.5989048596851472,3,127068,12.99,1650613.32,"No","Yes","Yes",0.2]
[2703,"2003-03-16",9.2484599589322389,10,77585,2.99,231979.15000000002,"No","Yes","No",0.09]
[2709,"2008-04-24",4.1396303901437372,2,465957,9.99,4654910.43,"No","No","No",0.09]
[2711,"2000-09-02",11.780971937029431,18,631323,2.99,1887655.77,"No","Yes","Yes",0.2]
[2713,"2011-01-06",1.4373716632443532,18,336643,2.99,1006562.5700000001,"Yes","Yes","No",0.15]
[2719,"2005-05-05",7.1101984941820673,25,432514,2.99,1293216.8600000001,"No","Yes","Yes",0.2]
[2720,"2010-08-30",1.7905544147843941,2,138335,7.99,1105296.6500000001,"No","No","No",0.09]
[2720,"2000-11-25",11.550992470910336,6,350110,2.99,1046828.9,"No","Yes","Yes",0.2]
[2722,"2007-06-08",5.0184804928131417,9,668605,5.99,4004943.95,"No","Yes","Yes",0.2]
[2723,"2000-09-20",11.731690622861054,24,699988,10.99,7692868.1200000001,"No","Yes","Yes",0.2]
[2726,"2010-09-23",1.7248459958932238,16,411873,2.99,1231500.27,"Yes","Yes","No",0.15]
[2727,"2011-10-04",0.69541409993155368,23,402736,2.99,1204180.6400000001,"Yes","Yes","No",0.15]
[2736,"2002-10-06",9.6892539356605063,11,54512,2.99,162990.88,"No","Yes","No",0.2]
[2737,"2005-03-26",7.2197125256673509,3,135179,5.99,809722.21000000008,"No","Yes","No",0.09]
[2737,"2001-07-14",10.91854893908282,12,289546,3.99,1155288.54,"No","Yes","Yes",0.2]
[2738,"2008-08-06",3.8548939082819986,11,47180,10.99,518508.2,"No","Yes","No",0.15]
[2738,"2004-06-16",7.9945242984257359,11,381215,5.99,2283477.85,"No","Yes","Yes",0.2]
[2739,"2004-10-01",7.7015742642026011,3,679940,5.99,4072840.6,"No","Yes","Yes",0.2]
[2745,"2003-10-04",8.6954140999315541,19,631973,12.99,8209329.2700000005,"No","Yes","Yes",0.2]
[2751,"2010-11-23",1.5578370978781657,15,403511,9.99,4031074.89,"Yes","Yes","No",0.15]
[2752,"2007-04-05",5.1937029431895958,8,620410,7.99,4957075.9000000004,"No","Yes","Yes",0.2]
[2755,"2007-08-11",4.8432580424366876,16,698700,3.99,2787813,"No","Yes","No",0.15]
[2758,"2012-10-18",-0.34496919917864477,20,492751,2.99,1473325.49,"Yes","Yes","No",0.15]
[2759,"2007-06-24",4.9746748802190277,16,70046,10.99,769805.54,"No","Yes","No",0.15]
[2763,"2007-07-10",4.9308692676249146,24,123958,10.99,1362298.42,"No","Yes","No",0.15]
[2763,"2011-06-27",0.96646132785763172,24,473554,12.99,6151466.46,"Yes","Yes","No",0.15]
[2763,"2003-10-08",8.6844626967830258,16,377635,2.99,1129128.6500000001,"No","Yes","Yes",0.2]
[2767,"2009-02-20",3.3127994524298425,9,398789,2.99,1192379.1100000001,"No","No","No",0.09]
[2771,"2000-05-07",12.10403832991102,9,284099,7.99,2269951.0100000002,"No","Yes","Yes",0.2]
[2771,"2005-05-08",7.1019849418206711,14,449830,15.99,7192781.7000000002,"No","Yes","Yes",0.2]
[2772,"2006-10-24",5.6399726214921291,5,6708,2.99,20056.920000000002,"No","Yes","No",0.09]
[2773,"2011-04-16",1.1635865845311431,2,188613,23.99,4524825.87,"No","No","No",0.09]
[2775,"2006-06-27",5.9657768651608487,18,592953,2.99,1772929.4700000002,"No","Yes","Yes",0.2]
[2775,"2000-03-04",12.279260780287474,6,133313,15.99,2131674.87,"No","Yes","Yes",0.2]
[2779,"2005-09-14",6.7488021902806299,11,461204,2.99,1378999.9600000002,"No","Yes","Yes",0.2]
[2781,"2004-10-27",7.6303901437371664,10,656291,5.99,3931183.0900000003,"No","Yes","Yes",0.2]
[2783,"2010-07-04",1.946611909650924,22,552032,12.99,7170895.6799999997,"Yes","Yes","No",0.15]
[2784,"2010-10-27",1.6317590691307324,22,211025,3.99,841989.75,"Yes","Yes","No",0.15]
[2785,"2010-11-01",1.6180698151950719,12,79169,12.99,1028405.31,"Yes","Yes","No",0.15]
[2786,"2000-03-31",12.205338809034908,10,126680,12.99,1645573.2,"No","Yes","Yes",0.2]
[2788,"2001-11-04",10.609171800136892,23,537999,10.99,5912609.0099999998,"No","Yes","Yes",0.2]
[2792,"2002-12-18",9.4893908281998627,5,366406,9.99,3660395.94,"No","Yes","Yes",0.2]
[2793,"2000-01-10",12.427104722792608,25,274355,12.99,3563871.45,"No","Yes","Yes",0.2]
[2797,"2011-08-31",0.7885010266940452,17,237397,2.99,709817.03,"Yes","Yes","No",0.15]
[2804,"2012-07-01",-4.6543463381245723E-2,11,563057,9.99,5624939.4299999997,"Yes","Yes","No",0.15]
[2810,"2004-07-07",7.9370294318959616,19,87382,2.99,261272.18000000002,"No","Yes","No",0.2]
[2812,"2000-11-19",11.567419575633128,20,187889,2.99,561788.11,"No","Yes","No",0.2]
[2817,"2009-08-14",2.8336755646817249,22,253788,7.99,2027766.12,"No","Yes","No",0.15]
[2819,"2008-01-29",4.3750855578370977,22,559865,10.99,6152916.3500000006,"No","Yes","No",0.15]
[2821,"2009-01-14",3.4140999315537304,11,526629,12.99,{"$f":"Number_of_Books_Sold*Sell_Price","v":6840910.71},{"$f":"IF(AND(Years_Under_Contract<2,Number_of_Books_in_Print>4)=TRUE,\"Yes\",\"No\")","v":"No"},{"$f":"IF(OR(Years_Under_Contract>5,Number_of_Books_in_Print>=10)=TRUE,\"Yes\",\"No\")","v":"Yes"},{"$f":"IF(AND(Years_Under_Contract>5,OR(Number_of_Books_in_Print>350000,Income_Earned>=1000000))=TRUE,\"Yes\",\"No\")","v":"No"},{"$f":"IF(AND(Years_Under_Contract>5,OR(Number_of_Books_in_Print>10,Income_Earned>1000000)),0.2,IF(Number_of_Books_in_Print>10,0.15,0.09))","v":0.15}]
[2822,"2009-11-08",2.5982203969883639,15,632249,23.99,15167653.51,"No","Yes","No",0.15]
[2822,"2008-08-17",3.8247775496235454,15,238159,12.99,3093685.41,"No","Yes","No",0.15]
[2822,"2008-10-30",3.6221765913757702,13,599740,2.99,1793222.6,"No","Yes","No",0.15]
[2823,"2005-05-12",7.0910335386721428,8,65072,5.99,389781.28,"No","Yes","No",0.09]
[2827,"2012-04-07",0.18617385352498289,24,500348,10.99,5498824.5200000005,"Yes","Yes","No",0.15]
[2831,"2012-06-17",-8.2135523613963042E-3,22,556262,7.99,4444533.38,"Yes","Yes","No",0.15]
[2833,"2007-09-01",4.7857631759069132,5,132722,9.99,1325892.78,"No","No","No",0.09]
[2835,"2001-11-27",10.546201232032855,11,513505,10.99,5643419.9500000002,"No","Yes","Yes",0.2]
[2836,"2002-06-29",9.9603011635865837,14,477451,3.99,1905029.49,"No","Yes","Yes",0.2]
[2838,"2005-08-18",6.8227241615331966,13,556491,10.99,6115836.0899999999,"No","Yes","Yes",0.2]
[2839,"2012-03-18",0.24093086926762491,23,678682,9.99,6780033.1799999997,"Yes","Yes","No",0.15]
[2842,"2010-07-15",1.9164955509924708,24,368248,10.99,4047045.52,"Yes","Yes","No",0.15]
[2842,"2010-06-02",2.0342231348391513,13,347083,5.99,2079027.1700000002,"No","Yes","No",0.15]
[2843,"2004-05-08",8.1013004791238874,22,480367,10.99,5279233.33,"No","Yes","Yes",0.2]
[2847,"2001-08-18",10.822724161533197,8,498792,3.99,1990180.08,"No","Yes","Yes",0.2]
[2850,"2009-11-16",2.5763175906913074,18,459977,3.99,1835308.2300000002,"No","Yes","No",0.15]
[2853,"2000-09-03",11.7782340862423,21,46382,7.99,370592.18,"No","Yes","No",0.2]
[2855,"2010-01-30",2.3709787816563996,13,155475,9.99,1553195.25,"No","Yes","No",0.15]
[2856,"2007-05-01",5.1225188227241611,4,546017,12.99,7092760.8300000001,"No","Yes","Yes",0.2]
[2857,"2011-04-18",1.1581108829568789,6,557985,7.99,4458300.1500000004,"Yes","No","No",0.09]
[2857,"2009-07-16",2.9130732375085557,14,56400,10.99,619836,"No","Yes","No",0.15]
[2858,"2008-06-15",3.9972621492128679,23,273264,7.99,2183379.36,"No","Yes","No",0.15]
[2866,"2007-10-24",4.6406570841889119,16,697648,10.99,7667151.5200000005,"No","Yes","No",0.15]
[2869,"2002-04-28",10.130047912388775,9,614017,10.99,6748046.8300000001,"No","Yes","Yes",0.2]
[2870,"2004-08-22",7.8110882956878847,14,61912,12.99,804236.88,"No","Yes","No",0.2]
[2871,"2006-07-28",5.8809034907597537,15,368386,2.99,1101474.1400000001,"No","Yes","Yes",0.2]
[2871,"2001-03-01",11.288158795345653,21,339364,10.99,3729610.36,"No","Yes","Yes",0.2]
[2873,"2002-12-12",9.5058179329226551,23,592626,2.99,1771951.7400000002,"No","Yes","Yes",0.2]
[2873,"2008-07-24",3.890485968514716,10,441099,5.99,2642183.0100000002,"No","Yes","No",0.09]
[2875,"2000-05-24",12.057494866529774,22,423882,2.99,1267407.1800000002,"No","Yes","Yes",0.2]
[2876,"2004-12-13",7.5017111567419574,1,619410,2.99,1852035.9000000001,"No","Yes","Yes",0.2]
[2877,"2001-12-01",10.535249828884325,11,552004,9.99,5514519.96,"No","Yes","Yes",0.2]
[2878,"2012-01-18",0.40520191649555098,2,164128,3.99,654870.72000000009,"No","No","No",0.09]
[2879,"2006-12-29",5.4592744695414099,13,258955,9.99,2586960.4500000002,"No","Yes","Yes",0.2]
[2880,"2009-06-20",2.9842573579739904,22,563371,2.99,1684479.29,"No","Yes","No",0.15]
[2880,"2000-05-14",12.084873374401095,5,525090,23.99,12596909.1,"No","Yes","Yes",0.2]
[2881,"2007-04-15",5.1663244353182751,2,146564,2.99,438226.36000000004,"No","Yes","No",0.09]
[2884,"2005-07-22",6.8966461327857633,19,433457,2.99,1296036.4300000002,"No","Yes","Yes",0.2]
[2888,"2002-12-20",9.4839151266255985,18,696800,3.99,2780232,"No","Yes","Yes",0.2]
[2890,"2002-11-17",9.5742642026009577,15,63985,10.99,703195.15,"No","Yes","No",0.2]
[2890,"2005-05-27",7.0499657768651609,16,232323,9.99,2320906.77,"No","Yes","Yes",0.2]
[2891,"2001-02-17",11.321013004791238,22,347686,9.99,3473383.14,"No","Yes","Yes",0.2]
[2892,"2005-09-30",6.7049965776865159,17,77191,15.99,1234284.0900000001,"No","Yes","Yes",0.2]
[2897,"2006-04-22",6.1464750171115679,21,287768,9.99,2874802.32,"No","Yes","Yes",0.2]
[2901,"2012-07-30",-0.12594113620807665,23,395212,12.99,5133803.88,"Yes","Yes","No",0.15]
[2902,"2006-05-07",6.1054072553045859,7,497052,9.99,4965549.4800000004,"No","Yes","Yes",0.2]
[2902,"2012-07-09",-6.8446269678302529E-2,15,568581,9.99,5680124.1900000004,"Yes","Yes","No",0.15]
[2903,"2009-09-29",2.707734428473648,3,396114,7.99,3164950.86,"No","No","No",0.09]
[2905,"2009-07-02",2.9514031485284051,24,342450,9.99,3421075.5,"No","Yes","No",0.15]
[2907,"2010-04-06",2.1902806297056809,1,680796,23.99,16332296.039999999,"No","No","No",0.09]
[2909,"2011-03-23",1.2292950034223136,2,375932,15.99,6011152.6799999997,"No","No","No",0.09]
[2909,"2007-12-31",4.4544832306639286,11,292422,5.99,1751607.78,"No","Yes","No",0.15]
[2913,"2000-12-18",11.488021902806297,24,268888,23.99,6450623.1199999992,"No","Yes","Yes",0.2]
[2916,"2010-02-06",2.3518138261464752,21,490678,15.99,7845941.2199999997,"No","Yes","No",0.15]
[2918,"2004-03-07",8.2710472279260774,24,269434,12.99,3499947.66,"No","Yes","Yes",0.2]
[2918,"2010-08-17",1.8261464750171115,20,645756,3.99,2576566.44,"Yes","Yes","No",0.15]
[2918,"2000-06-24",11.972621492128679,3,102060,15.99,1631939.4,"No","Yes","Yes",0.2]
[2919,"2002-03-22",10.231348391512663,6,269310,5.99,1613166.9000000001,"No","Yes","Yes",0.2]
[2919,"2009-11-19",2.5681040383299112,24,80290,15.99,1283837.1000000001,"No","Yes","No",0.15]
[2921,"2011-02-16",1.3251197809719371,14,226007,10.99,2483816.9300000002,"Yes","Yes","No",0.15]
[2923,"2004-01-03",8.4462696783025333,25,556920,2.99,1665190.8,"No","Yes","Yes",0.2]
[2926,"2006-09-20",5.7330595482546203,6,320320,12.99,4160956.8000000003,"No","Yes","Yes",0.2]
[2930,"2006-03-03",6.2833675564681721,9,524788,3.99,2093904.12,"No","Yes","Yes",0.2]
[2930,"2001-12-27",10.464065708418891,6,486878,9.99,{"$f":"Number_of_Books_Sold*Sell_Price","v":4863911.22},{"$f":"IF(AND(Years_Under_Contract<2,Number_of_Books_in_Print>4)=TRUE,\"Yes\",\"No\")","v":"No"},{"$f":"IF(OR(Years_Under_Contract>5,Number_of_Books_in_Print>=10)=TRUE,\"Yes\",\"No\")","v":"Yes"},{"$f":"IF(AND(Years_Under_Contract>5,OR(Number_of_Books_in_Print>350000,Income_Earned>=1000000))=TRUE,\"Yes\",\"No\")","v":"Yes"},{"$f":"IF(AND(Years_Under_Contract>5,OR(Number_of_Books_in_Print>10,Income_Earned>1000000)),0.2,IF(Number_of_Books_in_Print>10,0.15,0.09))","v":0.2}]
[2932,"2007-12-07",4.5201916495550991,11,119424,3.99,476501.76000000001,"No","Yes","No",0.15]
[2932,"2002-07-30",9.8754277891854887,13,542219,5.99,3247891.81,"No","Yes","Yes",0.2]
[2932,"2005-02-12",7.3347022587268995,19,647564,3.99,2583780.3600000003,"No","Yes","Yes",0.2]
[2933,"2001-05-21",11.066392881587953,4,235020,12.99,3052909.8000000003,"No","Yes","Yes",0.2]
[2933,"2008-10-13",3.6687200547570158,24,135452,2.99,405001.48000000004,"No","Yes","No",0.15]
[2934,"2008-03-01",4.2874743326488707,2,448038,10.99,4923937.62,"No","No","No",0.09]
[2934,"2002-02-15",10.327173169062286,7,631638,7.99,5046787.62,"No","Yes","Yes",0.2]
[2936,"2011-05-01",1.1225188227241616,13,549560,12.99,7138784.4000000004,"Yes","Yes","No",0.15]
[2937,"2009-06-07",3.0198494182067077,17,66313,23.99,1590848.8699999999,"No","Yes","No",0.15]
[2937,"2009-01-02",3.4469541409993156,2,655140,7.99,5234568.6000000006,"No","No","No",0.09]
[2938,"2012-04-06",0.18891170431211499,9,427001,3.99,1703733.99,"Yes","No","No",0.09]
[2938,"2011-10-09",0.68172484599589322,18,619701,5.99,3712008.99,"Yes","Yes","No",0.15]
[2940,"2010-03-01",2.2888432580424367,11,229440,12.99,2980425.6,"No","Yes","No",0.15]
[2943,"2011-04-18",1.1581108829568789,16,196121,12.99,2547611.79,"Yes","Yes","No",0.15]
[2943,"2006-08-29",5.7932922655715267,10,677564,3.99,2703480.3600000003,"No","Yes","Yes",0.2]
[2946,"2008-04-03",4.1971252566735116,8,82382,9.99,822996.18,"No","No","No",0.09]
[2947,"2001-02-10",11.340177960301164,16,237998,7.99,1901604.02,"No","Yes","Yes",0.2]
[2948,"2011-07-05",0.94455852156057496,9,215893,5.99,1293199.07,"Yes","No","No",0.09]
[2952,"2010-09-11",1.7577002053388091,25,364067,10.99,4001096.33,"Yes","Yes","No",0.15]
[2953,"2007-10-28",4.6297056810403836,2,126456,2.99,378103.44,"No","No","No",0.09]
[2956,"2007-01-21",5.3963039014373715,5,115358,12.99,1498500.42,"No","Yes","Yes",0.2]
[2957,"2002-11-13",9.5852156057494859,11,294503,2.99,880563.97000000009,"No","Yes","No",0.2]
[2957,"2005-02-17",7.3210130047912392,18,120651,2.99,360746.49000000005,"No","Yes","No",0.2]
[2958,"2008-08-23",3.808350444900753,2,428516,2.99,1281262.8400000001,"No","No","No",0.09]
[2958,"2007-04-21",5.1498973305954827,18,251238,15.99,4017295.62,"No","Yes","Yes",0.2]
[2958,"2007-04-24",5.1416837782340865,6,169901,3.99,677904.99,"No","Yes","No",0.09]
[2959,"2002-10-16",9.6618754277891856,20,11838,5.99,70909.62,"No","Yes","No",0.2]
[2959,"2008-10-09",3.6796714579055441,3,142474,10.99,1565789.26,"No","No","No",0.09]
[2964,"2012-07-08",-6.5708418891170434E-2,23,637834,2.99,1907123.6600000001,"Yes","Yes","No",0.15]
[2964,"2000-10-26",11.633127994524298,11,139172,15.99,2225360.2800000003,"No","Yes","Yes",0.2]
[2964,"2006-07-24",5.891854893908282,7,428674,23.99,10283889.26,"No","Yes","Yes",0.2]
[2965,"2000-12-09",11.512662559890487,16,238424,15.99,3812399.7600000002,"No","Yes","Yes",0.2]
[2966,"2000-01-17",12.407939767282683,16,146356,15.99,2340232.44,"No","Yes","Yes",0.2]
[2967,"2001-04-15",11.16495550992471,24,345657,5.99,2070485.4300000002,"No","Yes","Yes",0.2]
[2976,"2004-01-26",8.3832991101984948,13,369160,7.99,2949588.4,"No","Yes","Yes",0.2]
[2976,"2003-09-10",8.7611225188227237,7,489884,3.99,1954637.1600000001,"No","Yes","Yes",0.2]
[2976,"2002-11-19",9.5687885010266935,25,120541,2.99,360417.59,"No","Yes","No",0.2]
[2977,"2002-09-28",9.7111567419575628,3,356502,3.99,1422442.98,"No","Yes","Yes",0.2]
[2979,"2007-10-25",4.6379192334017798,8,381328,12.99,4953450.72,"No","No","No",0.09]
[2981,"2010-12-22",1.4784394250513346,17,52290,15.99,836117.1,"Yes","Yes","No",0.15]
[2983,"2000-11-13",11.58384668035592,1,376053,5.99,2252557.4700000002,"No","Yes","Yes",0.2]
[2984,"2012-06-18",-1.0951403148528405E-2,20,497555,2.99,1487689.4500000002,"Yes","Yes","No",0.15]
[2984,"2012-05-21",6.5708418891170434E-2,20,689482,15.99,11024817.18,"Yes","Yes","No",0.15]
[2985,"2011-05-29",1.0458590006844628,22,42545,2.99,127209.55,"Yes","Yes","No",0.15]
[2986,"2003-12-06",8.5229295003422312,8,630450,7.99,5037295.5,"No","Yes","Yes",0.2]
[2986,"2009-07-31",2.8720054757015743,22,376088,2.99,1124503.1200000001,"No","Yes","No",0.15]
[2997,"2002-04-06",10.190280629705681,24,44125,12.99,573183.75,"No","Yes","No",0.2]
[2999,"2003-10-30",8.6242299794661186,1,535446,7.99,4278213.54,"No","Yes","Yes",0.2]

{"sheet":"Sheet3","index":2,"n_rows":18,"n_cols":2,"rows_kept":18,"cut":false,"hidden":false,"merged":[]}
[1,"Jun"]
[2,"Jul"]
[3,"Aug"]
[4,"Sep"]
[5,"Oct"]
[6,"Nov"]
[7,"Dec"]
[8,"Jan"]
[9,"Feb"]
[10,"Mar"]
[11,"Apr"]
[12,"May"]
[13,"Jun"]
[14,"Jul"]
[15,"Aug"]
[16,"Sep"]
[17,"Oct"]
[18,"Nov"]

{"sheet":"Sheet5","index":3,"n_rows":17,"n_cols":2,"rows_kept":17,"cut":false,"hidden":false,"merged":[]}
["fri",68]
["sat",101]
["sun",134]
["mon",167]
["tue",200]
["wed",233]
["thu",266]
["fri",299]
["sat",332]
["sun",365]
["mon",398]
["tue",431]
["wed",464]
["thu",497]
["fri",530]
["sat",563]
["sun",596]